program: Gaussian 09
title: 000085566
version: EM64L-G09RevD.01
frameworkgroup: C1[X(C30H22)]
method: RPBEPBE
basis: SDD
operation: Freq
keyword: #p
keyword: freq=noraman
keyword: PBEPBE/SDD
title: #p freq=noraman PBEPBE/SDD
converged: YES YES NO NO
title: Mulliken charges:
elementType: C C C C C C C C C C C C C C C C C C C C C C C C C C C C C C H H H H H H H H H H H H H H H H H H H H H H
charge: 0.346208 0.346051 0.333037 0.332883 -0.563368 0.365750 0.365705 -0.566166 -0.566495 -0.413571 -0.413898 -0.417433 -0.417715 -0.242634 0.317853 0.317825 -0.417062 -0.417036 -0.238962 -0.238758 -0.399068 -0.395698 -0.395747 -0.399112 -0.239446 -0.236396 -0.236365 -0.239450 -0.241749 -0.241726 0.256472 0.249337 0.249583 0.243618 0.243805 0.243548 0.243720 0.225119 0.244299 0.244310 0.225091 0.225101 0.240054 0.239123 0.239158 0.240140 0.224930 0.225601 0.225605 0.224933 0.229500 0.229499
chargesum: 0.00000
title: Mulliken charges with hydrogens summed into heavy atoms:
elementType: C C C C C C C C C C C C C C C C C C C C C C C C C C C C C C
charge: 0.346208 0.346051 0.333037 0.332883 -0.306897 0.365750 0.365705 -0.316829 -0.316912 -0.169954 -0.170093 -0.173885 -0.173995 -0.017515 0.317853 0.317825 -0.172762 -0.172726 -0.013872 -0.013657 -0.159014 -0.156575 -0.156590 -0.158972 -0.014515 -0.010795 -0.010760 -0.014517 -0.012249 -0.012228
polarizability: 3.85668775e+02 -1.26435742e-01 4.59020827e+02 9.79650789e-02 1.96453388e+00 1.88060743e+02
1716.lowfreq: -2.9033 0.0004 0.0005 0.0007 2.5408 4.0913 11.7170 18.8300 29.3055
frequency: 11.4315 18.8291 29.2700 41.6259 55.6079 55.7283 79.2242 99.2474 99.4497 120.3655 131.7974 157.4159 225.1609 231.6035 252.3211 259.7451 269.3171 286.3511 292.8894 338.5352 341.3793 378.2950 401.1533 405.8642 406.2342 412.0380 450.1085 475.6518 489.0655 502.1951 515.6548 576.7006 605.5924 610.7570 610.8570 613.2685 618.4268 621.9869 624.9675 658.8821 691.3755 700.3166 700.9160 708.2942 708.7390 709.7216 722.5321 763.8914 766.4022 784.4491 798.9570 809.6636 816.1674 847.3862 849.0784 851.3581 899.7152 902.3709 906.1179 906.4777 919.6518 921.2836 924.4835 925.3710 972.6046 972.8485 979.6802 979.8627 980.2115 982.2773 985.3869 989.5498 991.0493 993.1686 993.2576 993.5742 1002.3883 1017.5916 1034.8868 1046.9053 1064.5443 1074.1221 1084.2520 1084.4854 1100.5815 1100.9913 1102.2805 1173.1717 1173.3740 1183.7151 1187.4598 1191.4535 1195.9585 1196.0900 1232.5283 1262.9802 1299.1727 1302.6409 1303.6311 1305.3842 1313.8564 1317.8181 1325.1059 1365.0884 1368.6343 1370.9947 1373.2540 1378.3178 1402.0163 1410.6149 1426.0036 1441.4781 1443.9666 1464.4321 1476.8789 1491.4780 1496.1705 1499.0071 1578.2113 1579.5446 1583.3375 1589.5950 1593.1725 1609.2888 1612.1135 1612.2488 1613.3862 1613.4467 3122.1026 3122.1470 3124.3677 3124.9413 3125.6046 3127.0352 3127.2860 3131.8301 3134.7826 3137.3626 3138.3354 3139.4953 3139.9725 3141.6483 3142.6707 3148.4128 3148.5645 3157.7338 3159.0833 3159.7971 3164.7292 3164.8061
redmass: 5.0361 5.9957 4.0143 3.9703 5.7267 4.7243 4.1586 4.8373 4.2603 4.6141 4.4865 4.3819 5.1544 4.2661 4.8712 4.9590 4.4867 4.6666 5.0057 5.4915 5.2082 4.5508 3.4234 2.8603 2.8369 3.4016 3.3944 3.4921 3.9610 3.5173 3.4718 4.1897 4.6537 7.2100 6.8250 6.6596 6.6904 6.4832 6.8183 4.7939 6.2554 1.6728 1.6834 1.7867 1.8558 2.0870 6.5899 1.8547 1.8775 5.0578 1.6381 1.6143 1.5719 1.4020 1.2504 3.3775 1.4023 1.4290 1.3662 1.3809 1.4734 1.5144 1.5674 1.6087 1.4317 1.4404 1.5624 1.3646 1.3833 5.2557 5.5682 4.4285 5.1620 1.3174 1.5645 2.8954 7.4190 3.4949 2.2590 2.0980 1.9810 1.7070 1.6081 1.6137 1.6467 1.7779 1.5393 1.0519 1.0520 1.0818 1.0918 1.1034 1.1228 1.1185 1.8393 2.2901 1.9033 1.4141 1.4612 1.5931 1.5182 1.4294 2.2218 4.5430 6.4652 7.8216 4.1326 4.3618 4.0159 3.2309 2.9369 2.4752 2.5321 2.1673 2.4910 2.9464 2.7314 2.8331 5.3261 5.2567 5.6003 6.2371 6.6918 5.8714 6.1723 6.4458 6.1272 6.1361 1.0845 1.0846 1.0859 1.0865 1.0864 1.0867 1.0864 1.0906 1.0904 1.0906 1.0916 1.0914 1.0918 1.0917 1.0915 1.0962 1.0963 1.0993 1.0992 1.0991 1.1016 1.1016
irintensity: 0.0040 0.0071 0.0930 0.0062 0.1092 0.0836 1.6108 0.6049 0.4900 0.0005 0.1228 0.1220 0.0726 0.1331 0.0523 0.1383 0.0068 0.0333 0.0046 0.0058 0.0219 0.0837 2.9641 0.0042 0.2194 0.2320 0.6865 4.2776 1.7134 5.5081 5.0147 1.4745 0.7185 14.6086 3.3183 0.8521 14.8007 1.4240 8.7286 5.7462 1.6568 49.7323 13.8830 17.7594 21.8396 57.1451 3.7524 109.7433 72.2110 9.5998 75.7161 0.0042 7.4145 0.0032 1.4168 0.7963 21.1254 3.5923 2.8077 2.0536 5.4573 2.0734 0.0022 0.8012 0.1737 0.7995 0.0951 1.4220 0.2605 0.0625 0.0003 0.3138 0.2044 0.1053 0.0727 0.0963 4.7957 0.0111 9.3233 1.4866 2.3374 5.5206 6.5771 8.6265 10.0172 16.1457 1.7742 0.0265 0.0042 1.9508 0.1055 0.3411 0.2194 0.5632 0.0950 1.1779 3.6498 4.5069 0.2776 5.6043 2.3897 0.5299 0.1688 3.1724 3.1814 1.1713 0.8603 0.1648 23.6287 21.3949 10.7620 0.0182 4.5166 33.7730 49.1568 3.0948 0.4734 2.5956 23.5513 9.2422 26.3694 3.5581 0.6401 0.0002 15.6162 44.8806 19.1429 5.2895 2.3272 12.1537 0.8897 1.3669 5.4386 8.5165 4.8507 3.3564 4.7322 40.7963 30.7537 14.8106 0.0929 1.2010 0.4277 30.7486 48.0576 11.3620 32.2731 42.3624 4.1448 41.0590
temp: 298.150 k
press: 1.00000 atm
elementType: 6 6 6 6 6 6 6 6 6 6 6 6 6 6 6 6 6 6 6 6 6 6 6 6 6 6 6 6 6 6 1 1 1 1 1 1 1 1 1 1 1 1 1 1 1 1 1 1 1 1 1 1
symmnumber: 1
zpe: 1093841.0 jmol-1
zpe.correction: 0.416622 hartree
zpe.thermalcorrener: 0.440067 hartree
zpe.thermalcorrenthalpy: 0.441012 hartree
zpe.thermalcorrgfe: 0.360687 hartree
zpe.sumelectzpe: -1154.419784 hartree
zpe.sumelectthermal: -1154.396338 hartree
zpe.sumelectthermalent: -1154.395394 hartree
zpe.sumelectthermalfe: -1154.475719 hartree
dipole: -0.0006 0.1627 -0.0287
dipole: 0.1652
quadrupole: -159.3500 -149.2114 -175.6539
quadrupole: -0.0318 0.0160 0.2801
quadrupole: 2.0551 12.1937 -14.2488 -0.0318 0.0160 0.2801
hfenergy: -1154.8364056 hartree
pointgroup: C01 [X(C30H22)]
dipole: 0.0002066 0.0641275 0.0105601 debye
polarizability: 385.6686266|0.0905065|458.942289|0.1306341|-5.0163309|188.13943 unknown
InChI: InChI=1S/C30H22/c1-3-10-23(11-4-1)25-14-7-16-27(20-25)29-18-9-19-30(22-29)28-17-8-15-26(21-28)24-12-5-2-6-13-24/h1-22H
charge 0 multiplicity 1
52 atoms
C  -1.2409 -2.676569 -0.19858
C  1.241626 -2.676152 -0.195695
C  -2.534726 -1.990978 0.093633
C  2.534377 -1.989806 0.099467
C  -0.000035 -2.043281 0.073589
C  -3.8830 0.090362 0.216794
C  3.882188 0.091828 0.221004
C  -2.666995 -0.586648 -0.060542
C  2.667281 -0.58604 -0.059088
C  -1.223299 -3.986853 -0.750443
C  1.226152 -3.986483 -0.747391
C  -3.663927 -2.729511 0.542152
C  3.66154 -2.7270 0.555133
C  0.001851 -4.632481 -1.018109
C  -3.995963 1.56738 0.033791
C  3.996113 1.568143 0.032923
C  -4.994737 -0.67612 0.662463
C  4.991873 -0.673199 0.674241
C  -4.880389 -2.07292 0.822659
C  4.876824 -2.069462 0.838658
C  -3.295666 2.233614 -1.0098
C  -4.809611 2.349331 0.899669
C  4.805292 2.353478 0.899899
C  3.301209 2.230221 -1.016916
C  -3.403155 3.630332 -1.180776
C  -4.920111 3.745784 0.728962
C  4.916551 3.749279 0.724354
C  3.409578 3.626258 -1.192828
C  -4.216759 4.394653 -0.312395
C  4.218566 4.394012 -0.323168
H  -0.000505 -1.059939 0.557741
H  -1.803077 -0.006071 -0.403503
H  1.804729 -0.00679 -0.407723
H  -2.167048 -4.485675 -0.997245
H  2.170874 -4.484826 -0.991436
H  -3.57911 -3.810216 0.700383
H  3.575851 -3.807217 0.716294
H  0.002507 -5.635509 -1.459099
H  -5.954501 -0.183098 0.852447
H  5.950792 -0.179538 0.866842
H  -5.743777 -2.652736 1.167498
H  5.738704 -2.648095 1.189209
H  -2.688142 1.649896 -1.710958
H  -5.334477 1.864367 1.73063
H  5.326005 1.871661 1.73528
H  2.697368 1.64366 -1.718869
H  -2.860905 4.120685 -1.997137
H  -5.545986 4.328736 1.414074
H  5.538856 4.334974 1.41038
H  2.87164 4.113398 -2.013953
H  -4.301095 5.47896 -0.444881
H  4.303545 5.477801 -0.459433
