program: Gaussian 09
title: 000085459
version: EM64L-G09RevD.01
frameworkgroup: C1[X(C20H16N2O2)]
method: RPBEPBE
basis: SDD
operation: Freq
keyword: #p
keyword: freq=noraman
keyword: PBEPBE/SDD
title: #p freq=noraman PBEPBE/SDD
converged: YES YES NO NO
title: Mulliken charges:
elementType: O O N N C C C C C C C C C C C C C C C C C C C C H H H H H H H H H H H H H H H H
charge: -0.259148 -0.211786 -0.456437 -0.465927 0.108171 0.172686 0.100286 0.040914 -0.355892 -0.385230 0.504103 0.480873 -0.227726 -0.229976 -0.345761 -0.340160 -0.447975 -0.441851 -0.215145 -0.216644 -0.199541 -0.196951 -0.254809 -0.250990 0.281415 0.256403 0.323026 0.321662 0.240071 0.238578 0.307984 0.310993 0.220575 0.221260 0.226121 0.231837 0.225413 0.229294 0.227872 0.232413
chargesum: 0.00000
title: Mulliken charges with hydrogens summed into heavy atoms:
elementType: O O N N C C C C C C C C C C C C C C C C C C C C
charge: -0.259148 -0.211786 -0.133411 -0.144265 0.108171 0.172686 0.100286 0.040914 -0.074476 -0.128827 0.504103 0.480873 0.012345 0.008601 -0.037777 -0.029168 -0.227401 -0.220592 0.010976 0.015193 0.025872 0.032343 -0.026937 -0.018576
polarizability: 2.81981395e+02 -2.24921993e+01 3.24195163e+02 -2.98618710e+01 -1.35595263e+01 1.39397056e+02
1716.lowfreq: -4.1305 -3.0976 -0.0006 -0.0004 0.0007 6.7054 13.2612 21.4538 32.8206
frequency: 13.1995 21.3397 32.7897 45.8943 59.1726 73.1197 81.4682 103.4296 132.3600 163.2944 185.8166 190.7948 215.9334 268.4807 289.6970 313.9725 330.1754 341.4354 378.2024 406.2806 407.7332 412.6939 487.1204 510.3741 512.8507 517.0534 572.1007 588.7248 614.1920 615.5854 636.5085 646.2800 671.8486 679.9154 695.6464 696.7265 698.0260 711.9320 769.6574 770.1543 773.9329 784.5066 811.9573 828.4321 843.2168 845.9756 858.5673 872.4396 899.1275 919.0523 921.5207 970.5383 973.1492 975.5816 984.5396 984.8476 1000.5459 1003.1745 1003.6689 1024.1103 1024.8854 1039.1315 1054.9443 1086.2205 1091.4509 1105.7577 1123.9039 1172.0509 1173.9182 1178.0351 1188.8282 1190.3796 1224.4076 1237.1879 1255.3555 1262.3883 1275.2532 1319.9090 1322.7446 1371.0588 1382.6890 1386.9250 1421.0903 1423.8638 1430.9076 1468.6799 1483.4942 1485.5782 1502.4405 1517.1758 1568.5685 1587.6048 1596.9723 1601.6942 1605.5181 1608.7070 1613.7683 1615.5253 3109.7516 3111.0626 3125.4073 3131.4577 3135.4796 3142.3550 3144.1836 3147.4753 3158.1300 3164.5387 3167.5714 3172.2969 3197.5319 3197.7674 3514.2228 3525.8418
redmass: 6.0491 4.8063 4.0911 5.2198 5.0367 5.5570 5.7124 5.8230 5.5980 5.6900 5.6961 5.3799 5.4485 4.3523 4.9993 5.9029 7.1743 7.7907 6.2952 3.0874 2.9376 3.6726 5.0716 4.9888 3.0310 3.0703 5.4729 5.3747 6.2585 6.3758 1.3925 4.2353 1.1717 4.7185 2.5046 4.2036 2.0124 3.9901 1.7944 1.6944 2.7168 1.9810 4.6282 4.7598 1.2686 1.2666 6.7427 6.8908 1.4925 1.4355 1.4225 1.3946 1.3552 1.3541 6.1112 6.1418 1.3079 1.3568 1.3091 2.4366 2.3701 2.6545 3.9396 1.6735 1.5984 2.4254 1.8715 1.0525 1.0517 1.0647 1.1143 1.1142 3.1840 2.8189 2.0412 2.0036 1.5838 1.4998 1.4808 10.2614 5.8065 6.8243 2.1529 2.3273 2.3795 2.4857 2.3405 2.4037 2.1042 2.2149 6.4997 7.1609 8.0922 5.4991 4.2171 4.3039 6.1683 6.2442 1.0886 1.0887 1.0876 1.0867 1.0869 1.0893 1.0934 1.0934 1.0941 1.0999 1.0998 1.0997 1.0950 1.0952 1.0765 1.0763
irintensity: 0.2575 1.8968 0.6111 1.6521 0.4091 1.4513 1.7781 3.7859 1.2386 6.2116 1.1503 2.1742 4.7375 4.0888 0.4394 3.2827 2.7711 5.0774 6.2517 0.9159 0.3951 2.2340 0.1917 2.4689 31.9353 24.8321 8.5633 15.6011 1.3554 2.6669 17.7641 11.0657 34.4235 9.4076 32.4550 25.6177 63.4247 14.3802 28.2019 167.6401 25.8486 23.3432 2.4902 3.3416 0.0888 0.2584 15.7169 14.6093 1.7296 16.7733 8.5285 2.8532 0.1760 0.1836 0.0967 0.0347 2.7796 1.9405 2.4962 1.4590 2.2057 15.6236 28.0144 15.8996 7.6828 14.4734 7.2263 0.6034 0.5068 0.5471 1.9560 1.2944 33.0380 50.8960 43.8796 41.7523 9.9783 63.0042 58.3396 4.0949 63.0952 68.9584 25.4075 91.1291 74.7350 4.4917 45.6159 74.4375 270.6831 359.2561 36.9903 166.4312 37.5567 24.3183 33.5207 39.2081 40.6762 28.0971 15.1260 13.2288 4.1178 0.5989 0.3396 7.6127 30.6461 26.0274 11.3250 28.5136 25.3054 21.6748 7.4714 7.4636 15.7382 19.0350
temp: 298.150 k
press: 1.00000 atm
elementType: 8 8 7 7 6 6 6 6 6 6 6 6 6 6 6 6 6 6 6 6 6 6 6 6 1 1 1 1 1 1 1 1 1 1 1 1 1 1 1 1
symmnumber: 1
zpe: 815165.0 jmol-1
zpe.correction: 0.310480 hartree
zpe.thermalcorrener: 0.330424 hartree
zpe.thermalcorrenthalpy: 0.331369 hartree
zpe.thermalcorrgfe: 0.258678 hartree
zpe.sumelectzpe: -1030.060408 hartree
zpe.sumelectthermal: -1030.040464 hartree
zpe.sumelectthermalent: -1030.039519 hartree
zpe.sumelectthermalfe: -1030.112210 hartree
dipole: 4.5807 1.2825 -4.3540
dipole: 6.4486
quadrupole: -134.5099 -114.4715 -144.1956
quadrupole: 1.8012 -3.2527 -7.0679
quadrupole: -3.4509 16.5875 -13.1366 1.8012 -3.2527 -7.0679
hfenergy: -1030.3708879 hartree
pointgroup: C01 [X(C20H16N2O2)]
dipole: 1.5073216 -0.4096611 -1.9992363 debye
polarizability: 257.9692975|6.0375171|333.4244811|-53.0899876|2.1296619|154.1798361 unknown
InChI: InChI=1S/C20H16N2O2/c23-19(21-15-9-3-1-4-10-15)17-13-7-8-14-18(17)20(24)22-16-11-5-2-6-12-16/h1-14,21-22H
charge 0 multiplicity 1
40 atoms
O  -2.405651 2.588553 1.028319
O  0.890302 0.048696 1.461526
N  -1.725777 0.632986 -0.075442
N  1.930145 -0.285598 -0.625752
C  -0.212043 2.579897 0.00573
C  1.051811 1.924318 -0.100169
C  -1.528635 1.927645 0.390591
C  1.267078 0.48806 0.334988
C  -0.287259 3.969841 -0.263903
C  2.192465 2.671202 -0.499064
C  -2.832847 -0.23454 0.146966
C  2.359594 -1.644393 -0.539951
C  0.850146 4.70274 -0.659285
C  2.096856 4.049507 -0.784834
C  -3.991834 0.150433 0.873534
C  2.150009 -2.450853 0.611003
C  -2.747278 -1.543432 -0.402409
C  3.018762 -2.189846 -1.675345
C  -5.04218 -0.778547 1.036627
C  2.605103 -3.787331 0.606129
C  -3.805733 -2.456806 -0.231596
C  3.465734 -3.525987 -1.662587
C  -4.963208 -2.079577 0.489465
C  3.261381 -4.334631 -0.51977
H  -1.259878 4.457481 -0.145972
H  3.17258 2.180651 -0.530956
H  -0.957656 0.213718 -0.603927
H  2.147943 0.191741 -1.505029
H  0.765717 5.775293 -0.863187
H  2.990649 4.610501 -1.077739
H  -4.049561 1.15479 1.295569
H  1.641288 -2.028308 1.478954
H  -1.846922 -1.847667 -0.952584
H  3.18174 -1.5685 -2.566006
H  -5.932305 -0.476986 1.600216
H  2.441823 -4.404669 1.496374
H  -3.724521 -3.463018 -0.657261
H  3.973268 -3.934199 -2.543339
H  -5.786476 -2.789213 0.623908
H  3.608571 -5.373052 -0.508892
