program: Gaussian 09
title: 000085500
version: EM64L-G09RevD.01
frameworkgroup: C1[X(C18H18ClN5O2)]
method: RPBEPBE
basis: SDD
operation: Freq
keyword: #p
keyword: freq=noraman
keyword: PBEPBE/SDD
title: #p freq=noraman PBEPBE/SDD
converged: YES YES NO NO
title: Mulliken charges:
elementType: Cl O O N N N N N C C C C C C C C C C C C C C C C C C H H H H H H H H H H H H H H H H H H
charge: -0.013131 -0.212511 -0.211952 -0.160945 -0.070529 -0.101670 -0.002756 0.018194 0.488771 -0.428618 -0.376459 -0.566664 0.403449 -0.352923 -0.426560 -0.660754 -0.058070 -0.315420 -0.804416 -0.147571 0.280546 -0.256238 -0.242819 0.410024 -0.373931 -0.364830 0.252920 0.244766 0.235057 0.220996 0.240637 0.239211 0.286979 0.259137 0.214301 0.246343 0.230326 0.287614 0.216860 0.246422 0.245959 0.282927 0.310409 0.286918
chargesum: 0.00000
title: Mulliken charges with hydrogens summed into heavy atoms:
elementType: Cl O O N N N N N C C C C C C C C C C C C C C C C C C
charge: -0.013131 -0.212511 -0.211952 -0.160945 -0.070529 -0.101670 -0.002756 0.018194 0.488771 0.069067 0.079594 -0.326027 0.403449 -0.113711 0.119557 0.030216 -0.058070 -0.027806 -0.095174 -0.147571 0.280546 -0.256238 0.040108 0.410024 -0.063521 -0.077912
polarizability: 7.71259470e+02 -2.78893639e+01 2.69540618e+02 2.02144735e+01 4.40769286e+00 1.19329448e+02
1716.lowfreq: -0.0023 -0.0018 -0.0016 0.5646 2.8317 7.5727 10.5954 16.8239 28.7933
frequency: 10.2373 16.6731 28.7860 36.9312 42.6378 54.9049 64.4767 90.3972 96.6448 104.0247 105.1737 135.0819 151.5294 155.8049 166.0185 174.3929 186.2255 196.8376 201.4574 215.2727 248.3005 272.0311 311.0733 314.6736 351.3378 355.3680 368.0950 378.2787 407.5838 436.2089 454.1333 465.6059 472.4980 479.3824 498.4263 518.8755 535.9166 551.2584 577.9281 597.6071 600.2585 639.1700 686.1248 690.4376 701.7192 739.1359 757.5213 764.6574 770.4407 790.2511 827.4177 830.9018 852.8844 859.6486 863.9529 897.2064 921.3389 932.4336 944.0161 985.0398 992.7201 999.0756 1003.4988 1018.2550 1023.1271 1044.6478 1051.0180 1075.4392 1098.1808 1106.1305 1122.0636 1131.8585 1166.5764 1191.2886 1195.9225 1200.4275 1223.8699 1236.9660 1269.0897 1271.6597 1278.7179 1295.8930 1301.4129 1313.6664 1342.6631 1351.8400 1353.8494 1375.2780 1389.8785 1394.6736 1398.0923 1402.6656 1415.9058 1442.7274 1448.9240 1453.4228 1456.3418 1470.4138 1477.9404 1484.4256 1491.3548 1497.4362 1507.7960 1541.9594 1566.1608 1588.6282 1620.1837 2198.6600 2990.6112 2993.4852 3005.5766 3007.2060 3016.9712 3055.4824 3061.9190 3079.2597 3085.3223 3088.1292 3093.7252 3099.2063 3152.8803 3154.8265 3165.5843 3175.9664 3187.5762 3191.1488
redmass: 7.4267 6.4723 9.4897 4.5712 6.9116 6.4862 7.2986 3.1444 2.5370 1.4131 3.0360 5.9316 8.0552 5.5934 5.6582 6.4392 8.5876 1.5606 4.2041 2.2220 2.4637 3.0977 6.2909 6.8681 6.9144 5.1056 3.7873 5.7197 4.1971 3.9986 3.7270 3.7158 5.4321 3.7143 5.0378 5.7102 4.6072 4.1097 4.6199 4.9267 3.0585 7.2542 5.7391 6.2083 7.5394 3.7463 3.6662 1.3217 4.7652 1.2357 1.4468 4.5032 2.1858 2.2226 1.4965 7.2704 1.4262 2.6081 4.5118 2.9844 1.4073 2.3514 1.3377 1.9779 2.7710 1.5686 1.8725 1.9991 2.7554 2.6565 1.4628 1.5966 1.8653 2.2734 3.7425 2.6795 1.6402 1.7564 1.9918 2.4626 1.3006 1.2592 1.3780 3.5470 1.2643 2.0922 2.8369 2.9048 6.0357 1.2263 1.6378 1.6727 6.0657 2.1678 1.7775 1.1831 1.0485 1.0476 1.0991 1.1760 1.6561 1.5266 1.5936 6.6842 9.0261 7.1168 6.1558 12.4246 1.0360 1.0364 1.0607 1.0609 1.0611 1.1023 1.1003 1.0967 1.1017 1.1014 1.1008 1.1011 1.0898 1.0875 1.0883 1.0956 1.0957 1.0932
irintensity: 1.0193 0.6643 3.2403 0.1559 1.2609 0.1881 0.3918 0.4606 3.4369 0.2503 2.8084 3.7695 0.4712 0.0989 0.1057 6.9929 1.8472 1.0213 1.8200 1.6271 0.8979 1.9947 4.4408 3.5259 2.8003 3.3754 1.2458 7.5636 0.9269 8.6530 2.1655 4.9784 14.2989 5.8195 4.8782 1.9220 1.3624 5.0689 3.2605 8.2553 1.9328 0.1859 23.7514 16.6084 18.6534 1.8336 0.1195 6.1601 16.1724 41.5038 21.6943 24.2386 47.7542 41.5887 44.0920 1.2967 30.4500 0.8187 1.1733 46.3911 2.5888 62.0153 0.0522 25.4476 37.1584 9.2437 12.6262 73.6859 22.5860 249.2382 19.1894 30.5825 13.1916 442.7998 911.2577 598.4289 38.2218 117.2070 250.7814 185.3962 14.7229 51.7856 39.7980 614.1899 19.8151 178.8363 42.5803 2.9586 72.3677 34.7412 81.1413 40.3946 45.3549 8.3212 23.2004 13.9287 11.6704 7.2433 2.8657 0.8207 30.8290 47.3086 120.0896 26.2634 21.2843 269.2133 694.7401 26.1498 29.8386 16.9942 30.8925 43.5931 49.9536 3.9528 3.8965 10.2440 40.3183 12.9197 22.1882 60.0210 33.7741 1.9575 2.0264 25.8516 0.8009 6.3979
temp: 298.150 k
press: 1.00000 atm
elementType: 17 8 8 7 7 7 7 7 6 6 6 6 6 6 6 6 6 6 6 6 6 6 6 6 6 6 1 1 1 1 1 1 1 1 1 1 1 1 1 1 1 1 1 1
symmnumber: 1
zpe: 871899.7 jmol-1
zpe.correction: 0.332089 hartree
zpe.thermalcorrener: 0.357532 hartree
zpe.thermalcorrenthalpy: 0.358476 hartree
zpe.thermalcorrgfe: 0.272577 hartree
zpe.sumelectzpe: -1578.971824 hartree
zpe.sumelectthermal: -1578.946381 hartree
zpe.sumelectthermalent: -1578.945437 hartree
zpe.sumelectthermalfe: -1579.031337 hartree
dipole: -10.1290 3.4291 -0.5963
dipole: 10.7103
quadrupole: -220.5090 -160.9977 -159.0881
quadrupole: -27.6122 1.6448 2.2352
quadrupole: -40.3107 19.2006 21.1102 -27.6122 1.6448 2.2352
hfenergy: -1579.3039135 hartree
pointgroup: C01 [X(C18H18Cl1N5O2)]
dipole: 4.0130369 1.2637791 0.2329761 debye
polarizability: 771.8146951|17.0264579|268.0205225|26.1926176|-9.7215331|120.2943184 unknown
InChI: InChI=1S/C18H18ClN5O2/c1-3-23(10-4-9-20)14-5-7-17(13(2)11-14)21-22-18-8-6-15(24(25)26)12-16(18)19/h5-8,11-12H,3-4,10H2,1-2H3
charge 0 multiplicity 1
44 atoms
Cl -3.459446 3.061598 -0.322302
O  -7.575546 -1.835917 -0.193332
O  -8.034979 0.390218 -0.421218
N  4.722924 0.849338 0.513201
N  -0.809972 -0.343959 0.157215
N  -1.641808 0.675576 0.024064
N  7.721021 -2.927964 -0.516793
N  -7.211812 -0.596819 -0.274763
C  3.356831 0.574056 0.404747
C  5.707245 -0.239601 0.606063
C  5.236259 2.240698 0.446761
C  2.85913 -0.770819 0.458248
C  1.488522 -1.07035 0.381966
C  2.395935 1.633937 0.249687
C  6.002705 -0.90946 -0.779707
C  5.371159 2.804151 -0.987692
C  0.549222 0.007645 0.234697
C  1.034896 1.351421 0.172315
C  1.015873 -2.508657 0.45584
C  6.949767 -2.027284 -0.651813
C  -3.007645 0.294932 -0.045897
C  -3.980149 1.328255 -0.206877
C  -3.479991 -1.052397 0.037208
C  -5.76841 -0.294887 -0.195607
C  -5.352512 1.051638 -0.28273
C  -4.843897 -1.355798 -0.035708
H  5.364406 -1.010533 1.319102
H  6.648189 0.170386 1.009746
H  4.580813 2.893011 1.051763
H  6.223466 2.253069 0.942136
H  3.550334 -1.610104 0.577427
H  2.721802 2.675055 0.188953
H  5.060939 -1.279711 -1.224963
H  6.418793 -0.159762 -1.476923
H  6.112061 2.235307 -1.576972
H  4.407776 2.770091 -1.524669
H  5.707079 3.856337 -0.949568
H  0.299484 2.153834 0.057129
H  1.868005 -3.202885 0.551588
H  0.341743 -2.659439 1.317379
H  0.436336 -2.782198 -0.443103
H  -2.727322 -1.836247 0.160705
H  -6.094673 1.843583 -0.406043
H  -5.214655 -2.381844 0.02704
