program: Gaussian 09
title: 000085357
version: EM64L-G09RevD.01
frameworkgroup: C1[X(C16H14)]
method: RPBEPBE
basis: SDD
operation: Freq
keyword: #p
keyword: freq=noraman
keyword: PBEPBE/SDD
title: #p freq=noraman PBEPBE/SDD
converged: YES YES NO YES
title: Mulliken charges:
elementType: C C C C C C C C C C C C C C C C H H H H H H H H H H H H H H
charge: -0.300590 -0.300590 -0.586813 -0.586813 0.287638 0.287638 0.286503 0.286504 -0.424972 -0.424972 -0.409049 -0.409049 -0.236880 -0.236880 -0.234338 -0.234338 0.241562 0.241562 0.228034 0.227897 0.228034 0.227897 0.236051 0.236050 0.238388 0.238388 0.223069 0.223070 0.223500 0.223500
chargesum: 0.00000
title: Mulliken charges with hydrogens summed into heavy atoms:
elementType: C C C C C C C C C C C C C C C C
charge: -0.059028 -0.059028 -0.130882 -0.130882 0.287638 0.287638 0.286503 0.286504 -0.188921 -0.188922 -0.170661 -0.170661 -0.013811 -0.013811 -0.010838 -0.010838
polarizability: 1.81854076e+02 5.07069091e+00 1.66553381e+02 -4.53128850e-05 -1.67705635e-03 1.19915180e+02
1716.lowfreq: -1.8256 -0.0005 0.0005 0.0006 7.1595 13.5165 38.4206 84.9243 129.4712
frequency: 38.4179 84.9219 129.4707 156.0783 225.8923 265.5813 267.2215 361.2071 410.7307 428.9754 450.1410 474.2461 521.7644 527.5435 545.2101 560.0861 592.0865 643.8307 709.6622 715.8423 724.4738 726.5184 748.1529 763.3188 807.0829 823.7785 842.7301 864.0112 875.3282 908.0019 926.4216 940.4756 970.8286 981.7767 983.0558 984.7379 1001.1215 1023.6646 1024.3712 1035.1376 1071.5882 1096.0374 1138.5217 1144.8597 1168.0011 1168.6075 1171.6756 1173.1931 1184.0716 1213.3071 1217.5652 1225.5483 1249.7444 1272.9942 1292.7922 1296.7328 1303.6386 1307.4320 1387.1094 1387.1215 1444.3630 1444.8079 1456.5917 1458.3525 1474.4136 1475.8226 1594.7079 1594.8401 1614.9023 1616.7436 2973.6334 2975.2282 2992.1688 3008.3745 3036.8464 3037.2033 3113.8879 3114.1265 3121.3035 3121.3690 3136.3838 3136.5231 3157.1619 3157.4654
redmass: 4.6802 3.9214 3.7428 4.0010 2.4373 4.5079 2.5630 3.6055 2.9432 3.1028 2.5582 4.2112 4.7967 3.6399 5.0476 3.6128 5.9150 4.9752 3.7556 2.5330 3.4849 4.4005 1.3650 1.3819 3.4001 4.4598 3.0480 1.3088 1.5027 2.2724 1.4866 1.4165 2.2371 1.4952 1.3267 1.8765 2.4778 2.1067 2.1789 2.5546 2.0886 2.1456 1.2215 1.2214 1.2225 1.0757 1.1982 1.8462 1.8404 1.3267 1.9055 1.5624 1.3767 1.7642 2.2405 1.7754 1.5337 1.5612 6.7444 6.9364 2.2713 2.4368 1.2774 1.1183 2.6333 2.1932 6.9995 6.9236 7.0696 7.0060 1.0669 1.0646 1.0803 1.0848 1.0982 1.0984 1.0861 1.0861 1.0888 1.0888 1.0940 1.0940 1.1002 1.1002
irintensity: 0.0042 0.1165 0.0475 1.3603 6.0631 0.5998 2.4024 0.8603 2.8167 7.0500 4.8861 0.6206 0.0674 4.1406 2.2738 2.3118 2.2594 0.1155 0.1666 7.6119 7.3479 1.5301 55.5966 91.8336 1.6619 0.6638 0.5225 0.2805 0.3550 0.2728 0.0253 1.2804 2.2213 1.1169 0.0596 3.0669 2.1254 2.2300 8.3681 2.1606 0.2431 8.6777 1.2193 2.2663 0.0020 0.2867 0.0002 0.9157 0.0003 0.6071 2.1695 0.0026 7.9745 0.0085 0.0092 0.6429 5.7037 2.1552 7.8444 1.6108 3.8117 0.0591 30.0138 1.3301 9.8843 31.9904 3.0071 0.2115 0.0862 0.8709 41.8315 5.2321 37.5932 67.6434 21.2124 25.2073 1.5019 11.8541 3.9731 2.3477 1.8110 64.5760 53.8157 18.9980
temp: 298.150 k
press: 1.00000 atm
elementType: 6 6 6 6 6 6 6 6 6 6 6 6 6 6 6 6 1 1 1 1 1 1 1 1 1 1 1 1 1 1
symmnumber: 1
zpe: 650718.6 jmol-1
zpe.correction: 0.247846 hartree
zpe.thermalcorrener: 0.259346 hartree
zpe.thermalcorrenthalpy: 0.260290 hartree
zpe.thermalcorrgfe: 0.209988 hartree
zpe.sumelectzpe: -617.016820 hartree
zpe.sumelectthermal: -617.005320 hartree
zpe.sumelectthermalent: -617.004376 hartree
zpe.sumelectthermalfe: -617.054678 hartree
dipole: 0.0000 0.0000 0.6398
dipole: 0.6398
quadrupole: -92.4922 -83.2258 -92.3838
quadrupole: 0.4456 0.0000 -0.0003
quadrupole: -3.1250 6.1415 -3.0165 0.4456 0.0000 -0.0003
hfenergy: -617.2646661 hartree
pointgroup: C01 [X(C16H14)]
dipole: 0.0000009 0.0000091 -0.2516992 debye
polarizability: 181.695591|-5.3020493|166.7118665|-0.0000197|0.0016776|119.9151799 unknown
InChI: InChI=1S/C16H14/c1-3-7-13-11(5-1)9-15-14-8-4-2-6-12(14)10-16(13)15/h1-8,15-16H,9-10H2
charge 0 multiplicity 1
30 atoms
C  -0.359428 0.703898 -1.416837
C  0.359415 -0.703798 -1.416886
C  0.699079 1.740952 -0.919266
C  -0.699096 -1.740888 -0.919396
C  -1.538599 0.486498 -0.47028
C  1.53858 -0.486466 -0.470307
C  1.722457 0.88968 -0.181089
C  -1.722475 -0.889669 -0.181162
C  -2.401109 1.453545 0.086828
C  2.401088 -1.453553 0.086736
C  2.762736 1.308061 0.674102
C  -2.762758 -1.308112 0.673995
C  -3.447832 1.035948 0.944549
C  3.447807 -1.036019 0.944492
C  3.626579 0.337668 1.238172
C  -3.626605 -0.33776 1.238129
H  -0.73106 0.976582 -2.423565
H  0.731052 -0.97641 -2.423631
H  0.249759 2.522148 -0.278631
H  1.172991 2.259535 -1.776888
H  -0.24978 -2.522133 -0.278818
H  -1.173004 -2.259405 -1.777061
H  -2.266076 2.519275 -0.135484
H  2.266056 -2.519268 -0.135652
H  2.902151 2.370698 0.906122
H  -2.902172 -2.370766 0.905938
H  -4.122244 1.778635 1.386073
H  4.122217 -1.778738 1.385964
H  4.436321 0.649723 1.907761
H  -4.43635 -0.649861 1.907692
