program: Gaussian 09
title: 000085328
version: EM64L-G09RevD.01
frameworkgroup: C1[X(C16H11N3O2)]
method: RPBEPBE
basis: SDD
operation: Freq
keyword: #p
keyword: freq=noraman
keyword: PBEPBE/SDD
title: #p freq=noraman PBEPBE/SDD
converged: NO YES NO NO
title: Mulliken charges:
elementType: O O N N N C C C C C C C C C C C C C C C C H H H H H H H H H H H
charge: -0.175318 -0.174877 -0.343150 -0.110908 -0.117549 0.502611 -0.343443 -0.333295 0.160049 0.160339 0.164107 -0.354243 -0.295561 -0.252122 -0.252439 0.178765 -0.339169 -0.295451 -0.203435 -0.200384 -0.235168 0.275653 0.272718 0.254051 0.277872 0.279948 0.279994 0.251857 0.275582 0.232061 0.229437 0.231468
chargesum: 0.00000
title: Mulliken charges with hydrogens summed into heavy atoms:
elementType: O O N N N C C C C C C C C C C C C C C C C
charge: -0.175318 -0.174877 -0.343150 -0.110908 -0.117549 0.502611 -0.067789 -0.060577 0.160049 0.160339 0.164107 -0.100193 -0.017689 0.027826 0.027556 0.178765 -0.087312 -0.019869 0.028626 0.029053 -0.003700
polarizability: 4.70797807e+02 -9.60513529e+00 1.99477633e+02 -1.10974574e+00 6.16755547e+00 8.33676245e+01
1716.lowfreq: -2.2459 -0.0006 -0.0002 0.0004 5.2538 6.1448 22.5446 29.4218 48.5319
frequency: 22.5094 29.4171 48.5303 52.1417 79.0731 102.6589 130.7365 153.8706 173.1454 232.0307 256.1887 276.6260 279.6032 331.6043 357.2154 396.9227 406.8675 418.2258 441.6417 498.1182 516.1568 545.0703 564.8408 572.3646 608.8990 621.3968 624.1127 633.0321 683.9408 692.0140 697.7205 734.1204 739.5374 783.9001 816.6096 824.0418 832.6736 854.0857 855.4518 899.0209 938.8940 943.0709 944.2803 970.3199 986.0083 987.3830 988.9615 996.0675 1003.1310 1003.6173 1014.9044 1057.2292 1075.7166 1087.6850 1123.4429 1139.3617 1160.4534 1170.7537 1191.7824 1196.5213 1238.7040 1287.7811 1304.0300 1307.6600 1337.7515 1360.1268 1380.5024 1391.1008 1429.6473 1444.4781 1464.8605 1493.1275 1573.0332 1583.1515 1592.7455 1602.3764 1611.3903 1623.4269 1676.1065 3128.7426 3140.0287 3153.3907 3160.2154 3165.6506 3166.1110 3172.5828 3191.4339 3197.2133 3207.9159 3236.1282
redmass: 4.6823 6.4118 4.2226 5.8939 5.9727 6.8598 7.5036 8.0830 8.5362 9.2995 6.3974 5.5753 4.2314 8.3590 5.8725 4.0572 2.9375 3.8428 9.3777 3.1216 6.2694 3.1383 8.4504 3.5375 6.5469 6.2597 3.2266 4.7029 7.8679 1.9048 6.7486 7.0972 3.4924 1.7807 6.3180 1.9143 1.2623 1.2868 1.6233 7.3007 6.9651 1.3128 1.4358 1.4143 6.1640 1.4491 1.3735 3.7336 1.3265 2.6566 2.0739 1.2411 1.4925 4.1598 1.4490 2.0834 1.2837 1.0610 1.5667 3.0465 2.9765 1.7187 1.3593 1.3966 6.2067 7.5092 7.1802 9.4122 3.6104 2.4274 2.2240 2.6084 7.2864 6.2352 6.9814 6.2797 6.3042 11.3447 11.4810 1.0852 1.0888 1.0930 1.0904 1.0892 1.0959 1.1000 1.0953 1.0955 1.0895 1.1110
irintensity: 0.0922 1.3219 0.9347 1.5453 0.5648 7.0300 0.7584 3.8203 1.3967 1.4818 1.4603 0.8814 0.0125 16.0214 3.3164 1.8687 0.0074 0.7126 0.1128 0.5145 18.4843 17.0671 0.8576 15.6889 1.1200 27.0496 9.4749 5.8342 40.2062 60.5317 0.3889 6.6323 4.9329 45.3200 0.0191 41.9284 4.4094 11.1679 81.1038 0.9876 17.1305 0.2359 7.7148 6.1357 1.4196 4.6002 0.1374 11.9942 0.7829 2.0436 9.8861 46.4248 11.6162 42.5162 32.5280 1.6882 65.1535 0.0905 0.6238 69.2040 13.3697 1.6313 1.5013 3.4040 712.7080 34.9857 1.5163 2.4877 23.6660 5.4716 0.6628 163.7038 22.3019 0.7525 34.2322 1.7163 93.5122 397.7968 13.6180 2.2387 10.0392 22.1006 3.2572 0.6855 17.1305 36.1367 2.6729 2.7994 0.0628 0.7598
temp: 298.150 k
press: 1.00000 atm
elementType: 8 8 7 7 7 6 6 6 6 6 6 6 6 6 6 6 6 6 6 6 6 1 1 1 1 1 1 1 1 1 1 1
symmnumber: 1
zpe: 612410.9 jmol-1
zpe.correction: 0.233255 hartree
zpe.thermalcorrener: 0.250127 hartree
zpe.thermalcorrenthalpy: 0.251071 hartree
zpe.thermalcorrgfe: 0.186295 hartree
zpe.sumelectzpe: -929.530106 hartree
zpe.sumelectthermal: -929.513234 hartree
zpe.sumelectthermalent: -929.512290 hartree
zpe.sumelectthermalfe: -929.577065 hartree
dipole: 1.3745 0.1604 0.0736
dipole: 1.3858
quadrupole: -72.7918 -122.4403 -125.0057
quadrupole: 2.1941 -0.1585 7.8488
quadrupole: 33.9541 -15.6944 -18.2597 2.1941 -0.1585 7.8488
hfenergy: -929.7633605 hartree
pointgroup: C01 [X(C16H11N3O2)]
dipole: -0.5404941 -0.0098857 -0.0709972 debye
polarizability: 470.8064414|4.9965304|92.6809682|-8.2367371|-32.1081076|190.1556552 unknown
InChI: InChI=1S/C16H11N3O2/c20-15-10-11-16(21)19(15)14-8-6-13(7-9-14)18-17-12-4-2-1-3-5-12/h1-11H
charge 0 multiplicity 1
32 atoms
O  -4.335975 -1.362745 1.830266
O  -3.953031 1.33177 -2.033724
N  -3.693668 -0.017358 -0.058198
N  1.962116 -0.034923 0.61416
N  2.71107 0.064774 -0.454905
C  -2.263956 -0.017551 0.083631
C  -1.678282 -0.097818 1.373325
C  -1.436374 0.059962 -1.071824
C  -4.622017 -0.682027 0.817986
C  -4.431746 0.646791 -1.100154
C  0.554413 -0.021272 0.353635
C  -0.277634 -0.105689 1.49895
C  -0.04053 0.063314 -0.936804
C  -5.996305 -0.402077 0.275758
C  -5.885999 0.368456 -0.837276
C  4.121408 0.042724 -0.200128
C  4.943315 0.170855 -1.35105
C  4.714858 -0.09728 1.087336
C  6.347861 0.162552 -1.221934
C  6.116604 -0.105813 1.206704
C  6.937825 0.024404 0.056523
H  -2.307971 -0.169283 2.26174
H  -1.88889 0.129735 -2.062943
H  0.196801 -0.171096 2.483032
H  0.610396 0.12407 -1.813699
H  -6.887689 -0.797863 0.762139
H  -6.664557 0.766056 -1.488098
H  4.456198 0.275291 -2.326234
H  4.062123 -0.196232 1.959962
H  6.979555 0.262657 -2.111067
H  6.579355 -0.214663 2.194152
H  8.028625 0.01678 0.160141
