program: Gaussian 09
title: 000085492
version: EM64L-G09RevD.01
frameworkgroup: C1[X(C19H24Cl2N4O4S)]
method: RPBEPBE
basis: SDD
operation: Freq
keyword: #p
keyword: freq=noraman
keyword: PBEPBE/SDD
title: #p freq=noraman PBEPBE/SDD
converged: YES YES NO NO
title: Mulliken charges:
elementType: Cl Cl S O O O O N N N N C C C C C C C C C C C C C C C C C C C H H H H H H H H H H H H H H H H H H H H H H H H
charge: -0.015501 -0.068478 0.934798 -0.461876 -0.461261 -0.525800 -0.535179 -0.129973 -0.523493 -0.076533 -0.113392 0.468314 -0.440563 -0.440564 -0.574997 0.415717 -0.344811 -0.299868 -0.300971 -0.063897 -0.315139 -0.807827 -0.045006 -0.248669 -0.235582 0.284339 -0.352968 -0.262984 -0.263750 -0.529979 0.219072 0.300388 0.218643 0.302340 0.234303 0.230742 0.218752 0.202606 0.219873 0.201442 0.284269 0.243846 0.243222 0.211991 0.329605 0.313615 0.277713 0.247251 0.292134 0.285065 0.354560 0.354253 0.273689 0.276517
chargesum: 0.00000
title: Mulliken charges with hydrogens summed into heavy atoms:
elementType: Cl Cl S O O O O N N N N C C C C C C C C C C C C C C C C C C C
charge: -0.015501 -0.068478 0.934798 -0.107316 -0.107008 -0.525800 -0.535179 -0.129973 -0.193888 -0.076533 -0.113392 0.468314 0.078897 0.080419 -0.340694 0.415717 -0.114069 0.121491 0.120344 -0.063897 -0.030870 -0.108768 -0.045006 0.064946 0.042131 0.284339 0.186416 -0.262984 0.021316 0.020227
polarizability: 7.76920287e+02 -3.22080330e+01 2.82902703e+02 2.49138987e+01 3.86410895e+01 2.12748208e+02
1716.lowfreq: -6.0223 -1.6043 -0.0023 -0.0017 -0.0013 1.6794 7.7013 10.2323 17.0951
frequency: 7.5588 8.7493 17.0146 22.7722 29.3221 36.7589 43.2877 45.0284 63.4778 66.3512 74.4841 89.2020 103.9432 107.4138 110.3740 113.8763 135.0016 138.5435 155.0607 161.0018 180.8707 190.7700 201.2072 207.1788 216.5238 219.7941 229.1268 246.5934 250.7688 257.6539 265.5475 295.0151 312.5954 328.8282 338.3255 360.3390 374.6389 388.4582 395.6357 407.0088 422.0488 425.0638 455.4371 459.3721 474.2948 483.6869 501.1679 518.4981 549.3550 562.5806 575.8408 593.0994 605.6904 630.7701 668.8044 673.4556 704.8462 723.7188 736.6847 754.6283 788.3602 797.4407 805.0094 817.8530 825.1091 846.3793 848.8893 853.0684 867.8504 892.2219 902.0098 904.5737 936.6565 937.5794 985.8632 986.6276 989.1850 989.7369 1010.2899 1016.4498 1022.6337 1030.6521 1035.1254 1045.2194 1052.8033 1060.9833 1076.7437 1088.5066 1107.7464 1128.3989 1147.5805 1157.9483 1178.4063 1189.1443 1200.5503 1210.0597 1218.9086 1225.2280 1225.8109 1250.9967 1267.2139 1270.1917 1285.4910 1286.5823 1294.5217 1310.3850 1313.3663 1348.9503 1359.7290 1360.6383 1365.5089 1374.3937 1394.4188 1395.9599 1398.8740 1400.8764 1404.2419 1433.1188 1450.6226 1454.4767 1455.9152 1459.5323 1472.7361 1473.8835 1476.9823 1494.5382 1495.7020 1522.1020 1535.8287 1561.8168 1570.6141 1623.4900 2946.8940 2947.7648 2979.0325 2991.5148 3006.4854 3007.3901 3026.5679 3030.9577 3056.5959 3067.6747 3077.4365 3090.2547 3091.0774 3095.5369 3151.7938 3155.5505 3155.7612 3155.8903 3164.3441 3172.7381 3173.2670 3391.7512 3581.8362 3582.0346
redmass: 12.3152 5.5653 11.4792 6.4881 5.8197 3.5374 5.0137 4.9951 4.7800 4.4914 4.9255 5.9098 1.4508 3.4710 3.2918 3.9624 3.4112 5.6221 6.3780 5.4149 6.0214 6.9191 8.9580 3.3093 4.5044 3.3763 5.9210 2.0009 3.6661 1.2036 1.6958 5.7590 4.5457 6.3125 5.5356 6.5329 4.6116 4.6902 3.6027 4.7727 7.1353 3.3208 3.3107 3.4091 4.4208 4.4089 3.0295 4.2446 2.5685 3.4614 4.2246 4.4736 3.0156 6.2096 4.6301 3.9138 5.1875 1.8827 3.6203 3.4872 6.0532 1.5439 4.0970 1.4838 3.9214 1.4729 2.3211 1.5485 3.2210 6.6283 1.3727 2.2753 2.3753 10.8699 1.6216 1.5330 1.3999 3.8525 1.8400 1.4940 4.8704 3.4472 2.6054 1.5652 2.3566 1.7524 3.5445 1.8698 2.2643 1.4453 1.7175 1.2268 1.4211 2.3740 1.1640 1.0940 1.4687 1.6100 1.5901 1.1576 1.6252 2.8061 1.1414 1.2310 1.3917 1.3680 2.5608 1.2922 1.3329 1.4423 3.3747 3.6406 2.5576 1.7774 1.4249 1.4443 2.2912 2.4465 1.5958 1.0860 1.0491 1.0831 1.0794 1.0834 1.1188 1.4050 2.3039 1.8651 6.6064 8.3076 7.2005 6.1615 1.0566 1.0564 1.0629 1.0362 1.1010 1.1024 1.0687 1.0666 1.0991 1.0573 1.0967 1.1011 1.1007 1.1008 1.0869 1.1120 1.0877 1.0899 1.0926 1.0958 1.0967 1.0760 1.0667 1.0667
irintensity: 0.1334 0.1092 0.2279 0.1015 0.4946 0.2030 0.1859 0.2675 2.9998 1.8324 2.1004 0.9259 1.7534 10.0384 21.6108 3.2296 4.8483 3.7911 3.1317 5.3169 6.1212 3.2274 5.0680 1.1862 8.2869 12.4810 6.0170 71.0686 18.5135 212.6035 93.2939 5.0801 1.7555 4.9123 11.2332 33.1853 53.3407 10.9564 16.0541 17.3271 54.8826 6.2714 0.0728 16.9632 49.2763 30.3294 6.1504 37.4059 34.2397 7.0108 35.6359 20.6512 2.4606 15.3384 8.3274 206.7292 18.5742 88.6524 1.4448 0.8628 45.4631 18.0839 137.5709 23.8980 57.7449 26.6336 23.3788 53.5246 50.9135 15.5503 17.5657 3.0068 21.4674 60.7910 22.9859 11.5308 6.4564 26.9369 18.6479 3.5622 46.7989 65.8676 109.9022 7.9880 91.3337 0.9092 15.1439 11.9973 176.4149 0.3600 77.2887 4.0387 4.0390 33.6097 222.7960 7.6336 136.9947 12.3589 138.4330 17.7618 386.6347 62.3458 1.6959 10.8478 49.8481 334.9896 675.9625 1.1102 20.1359 92.1686 11.7957 20.6712 43.5231 8.6542 54.8936 10.8751 101.0709 19.7821 13.7399 9.1983 12.9047 30.8247 4.7802 20.3508 17.6778 51.6401 7.4606 85.1743 22.7970 38.1128 74.4773 779.0210 78.8225 27.5587 14.0654 21.7460 11.6613 95.7666 75.5009 65.1094 4.1132 16.5103 11.7465 3.0391 25.7144 2.5841 3.3820 11.4898 1.7657 29.6259 11.0824 27.6178 0.1418 29.6033 6.8724 4.0978
temp: 298.150 k
press: 1.00000 atm
elementType: 17 17 16 8 8 8 8 7 7 7 7 6 6 6 6 6 6 6 6 6 6 6 6 6 6 6 6 6 6 6 1 1 1 1 1 1 1 1 1 1 1 1 1 1 1 1 1 1 1 1 1 1 1 1
symmnumber: 1
zpe: 1075338.7 jmol-1
zpe.correction: 0.409575 hartree
zpe.thermalcorrener: 0.442578 hartree
zpe.thermalcorrenthalpy: 0.443522 hartree
zpe.thermalcorrgfe: 0.338278 hartree
zpe.sumelectzpe: -2574.007824 hartree
zpe.sumelectthermal: -2573.974821 hartree
zpe.sumelectthermalent: -2573.973877 hartree
zpe.sumelectthermalfe: -2574.079120 hartree
dipole: -12.1027 -0.2378 -3.9281
dipole: 12.7264
quadrupole: -178.5636 -194.3072 -198.2362
quadrupole: 1.8310 -18.3319 8.5227
quadrupole: 11.8054 -3.9382 -7.8672 1.8310 -18.3319 8.5227
hfenergy: -2574.4173986 hartree
pointgroup: C01 [X(C19H24Cl2N4O4S1)]
dipole: 4.7489226 0.1360112 -1.5808064 debye
polarizability: 778.9257147|-8.6631454|268.916438|-22.1244103|-47.5905253|224.729046 unknown
InChI: InChI=1S/C19H24Cl2N4O4S/c1-14-12-15(25(8-10-26)9-11-27)2-4-18(14)23-24-19-5-3-16(13-17(19)21)30(28,29)22-7-6-20/h2-5,12-13,22,26-27H,6-11H2,1H3
charge 0 multiplicity 1
54 atoms
Cl -2.076057 -1.724555 2.487925
Cl -7.57375 -4.03515 -0.857057
S  -6.430877 1.014393 0.373032
O  7.538652 -2.609891 -0.690488
O  8.14492 1.63987 0.611779
O  -7.061767 0.321985 1.710616
O  -6.70511 2.566269 -0.039052
N  5.917884 -0.20666 -0.067172
N  -7.015326 0.047566 -1.137658
N  0.323566 0.663211 -0.233002
N  -0.430145 -0.043302 0.59568
C  4.543876 -0.007798 -0.093624
C  6.561338 -1.103875 0.915635
C  6.824458 0.462837 -1.02251
C  3.938718 0.934925 -0.995148
C  2.55309 1.150062 -1.041015
C  3.665964 -0.740692 0.785296
C  6.621925 -2.569997 0.461135
C  7.281372 1.855135 -0.561467
C  1.70021 0.407561 -0.151222
C  2.291086 -0.532224 0.752688
C  1.967481 2.159287 -2.009674
C  -4.582304 0.705784 0.409806
C  -4.101295 -0.259399 1.307965
C  -3.756643 1.465575 -0.440169
C  -1.817007 0.247586 0.492021
C  -7.682724 -1.242956 -0.82304
C  -2.711914 -0.477674 1.334445
C  -2.375127 1.226926 -0.38842
C  -6.728003 -2.381714 -1.204379
H  6.041194 -1.03867 1.887323
H  7.587576 -0.736188 1.078891
H  6.341844 0.539077 -2.012844
H  7.710053 -0.181137 -1.148689
H  4.56573 1.523675 -1.670156
H  4.0711 -1.478323 1.482521
H  5.612714 -2.934458 0.179621
H  7.010827 -3.189096 1.298087
H  6.407471 2.487183 -0.302363
H  7.848403 2.33881 -1.385891
H  1.62178 -1.088568 1.416507
H  1.244623 1.678621 -2.692088
H  1.410466 2.946815 -1.472116
H  2.758955 2.635709 -2.613434
H  -7.613996 0.73543 -1.630334
H  -4.781247 -0.79631 1.976431
H  -4.186533 2.226244 -1.098723
H  -8.620727 -1.321769 -1.401944
H  -7.951283 -1.304413 0.251649
H  -1.675911 1.782433 -1.020243
H  7.554053 -3.519305 -1.078891
H  8.395832 2.508964 1.011645
H  -6.488994 -2.379116 -2.276885
H  -5.807424 -2.375696 -0.602797
