program: Gaussian 09
title: 000085265
version: EM64L-G09RevD.01
frameworkgroup: C1[X(C11H24O4Si)]
method: RPBEPBE
basis: SDD
operation: Freq
keyword: #p
keyword: freq=noraman
keyword: PBEPBE/SDD
title: #p freq=noraman PBEPBE/SDD
converged: YES YES NO NO
title: Mulliken charges:
elementType: Si O O O O C C C C C C C C C C C H H H H H H H H H H H H H H H H H H H H H H H H
charge: 1.478705 -0.591720 -0.592421 -0.266299 -0.241189 -0.881611 -0.328922 -1.067832 -0.495577 -0.202087 -0.199846 0.235858 -0.663831 -0.662842 -0.226366 -0.672600 0.245444 0.243687 0.220943 0.228392 0.255941 0.259029 0.238199 0.241917 0.241852 0.202290 0.188150 0.193643 0.200081 0.227157 0.224593 0.196498 0.225095 0.223873 0.197399 0.227358 0.226910 0.229530 0.229496 0.211104
chargesum: 0.00000
title: Mulliken charges with hydrogens summed into heavy atoms:
elementType: Si O O O O C C C C C C C C C C C
charge: 1.478705 -0.591720 -0.592421 -0.266299 -0.241189 -0.392480 0.120413 -0.314663 -0.011808 0.188354 0.193878 0.235858 -0.015583 -0.016475 0.227901 -0.002470
polarizability: 1.92916163e+02 -3.22118641e+00 1.43271904e+02 9.55668134e-01 1.95564294e+00 1.37425022e+02
1716.lowfreq: -14.2123 -12.2663 -6.0120 -0.0011 0.0006 0.0012 5.7643 13.9068 17.5161
frequency: -13.1649 13.3508 16.7470 26.8442 37.5728 46.8110 53.3138 58.5895 77.7464 80.9168 88.4709 97.0139 113.1960 125.7378 151.5535 180.9110 196.0639 210.0039 214.5842 248.3808 249.5240 250.9993 279.6875 299.1521 338.3427 345.3072 383.6590 402.1343 462.2089 547.9413 592.9679 663.1719 670.3439 694.9863 720.7305 764.7262 796.9095 803.7211 804.2524 808.7615 816.6016 854.4053 871.0863 913.5466 931.2491 937.2417 992.4126 1015.7162 1029.3557 1057.7967 1067.6847 1071.1341 1101.9696 1103.2583 1112.0367 1121.1942 1127.1496 1135.7630 1135.9030 1136.0758 1209.3672 1242.5662 1247.9194 1260.3287 1262.7948 1296.7528 1298.3535 1310.2716 1350.6945 1361.4906 1363.0950 1364.6533 1388.2296 1389.2473 1400.1184 1432.9105 1437.8149 1442.0058 1451.2524 1456.5870 1457.2904 1463.3772 1474.2947 1475.4844 1477.6854 1478.9975 1487.0726 1489.9399 1492.9204 1639.7912 2934.7862 2940.1783 2978.7809 2987.6945 2987.9640 2988.3178 2989.3973 2992.9870 2995.0104 2995.3787 2999.3483 3008.4517 3024.1828 3036.7911 3063.2472 3066.3848 3085.5516 3085.8637 3092.0952 3099.1432 3100.0848 3100.6069 3100.8690 3106.7019
redmass: 4.2305 3.2690 2.7568 2.2217 3.6120 3.5124 1.9740 2.1274 1.9229 3.1538 2.1068 2.0098 2.0459 3.0020 2.1160 4.6745 2.4293 2.5627 3.4938 1.5194 1.1958 1.2647 2.9158 3.9478 3.8415 4.1626 3.7673 4.1070 3.8250 2.6321 4.2904 4.7805 3.0901 2.0404 2.0909 2.0081 1.1035 1.1217 1.0898 2.4635 2.7675 1.4657 1.5732 5.1546 2.5635 2.7455 1.5153 2.9547 3.4799 4.5675 4.5909 2.5009 2.1254 2.1476 2.3265 1.2666 3.1523 1.4648 1.4686 1.4789 1.4131 1.2576 1.1357 1.1313 1.1272 1.1086 1.4520 1.2040 1.3900 1.2574 1.3746 1.4155 1.2575 1.2593 1.2678 1.0849 1.0630 1.0669 1.0497 1.0415 1.0417 1.0404 1.0590 1.0605 1.0526 1.0709 1.0702 1.0787 1.0823 9.7571 1.0571 1.0559 1.0592 1.0597 1.0397 1.0439 1.0937 1.0956 1.0446 1.0358 1.0596 1.0581 1.0983 1.0997 1.1025 1.1066 1.0985 1.0985 1.0986 1.0978 1.1010 1.0988 1.1012 1.1025
irintensity: 0.6356 0.1290 0.0156 0.0930 0.5143 0.2983 1.5609 0.4866 0.0900 1.5858 3.9123 5.0444 0.9249 1.7610 7.1054 3.8567 1.8812 6.1880 10.1616 0.1998 2.2924 1.7787 15.9079 2.6852 14.3398 16.4256 7.7524 26.1872 0.5456 1.6283 4.0461 11.0036 25.8390 23.8836 33.4999 21.8404 2.6288 5.2748 3.2206 14.3972 23.4017 58.2078 65.0049 35.4373 80.8338 155.9675 65.4528 14.4194 216.7574 228.6278 173.6808 35.2825 5.9829 8.5099 26.3667 1.6720 278.9123 4.5444 5.8981 3.0267 119.7331 2.6753 0.0351 1.0234 0.6257 7.3653 34.8607 52.8093 14.2897 10.2367 27.5992 2.2345 23.9861 33.7236 18.2891 5.1000 8.4372 24.7656 16.1252 10.0157 10.5377 11.9410 5.5848 3.6030 6.4709 11.6628 13.9094 7.0870 0.3787 161.6951 55.3202 61.0015 9.1716 14.2158 41.9167 16.1953 35.7645 36.7063 20.1663 22.0046 28.3305 21.4434 1.9601 0.7915 40.1616 13.2503 39.1619 39.1571 31.1209 12.4579 31.7085 18.9247 44.2235 45.9152
temp: 298.150 k
press: 1.00000 atm
elementType: 14 8 8 8 8 6 6 6 6 6 6 6 6 6 6 6 1 1 1 1 1 1 1 1 1 1 1 1 1 1 1 1 1 1 1 1 1 1 1 1
symmnumber: 1
zpe: 885906.7 jmol-1
zpe.correction: 0.337424 hartree
zpe.thermalcorrener: 0.359780 hartree
zpe.thermalcorrenthalpy: 0.360724 hartree
zpe.thermalcorrgfe: 0.280762 hartree
zpe.sumelectzpe: -1022.593746 hartree
zpe.sumelectthermal: -1022.571390 hartree
zpe.sumelectthermalent: -1022.570446 hartree
zpe.sumelectthermalfe: -1022.650409 hartree
dipole: -0.7031 -0.9183 -1.3254
dipole: 1.7591
quadrupole: -86.5965 -107.1213 -108.4859
quadrupole: 1.9211 3.9833 -8.1235
quadrupole: 14.1381 -6.3867 -7.7513 1.9211 3.9833 -8.1235
hfenergy: -1022.9311703 hartree
pointgroup: C01 [X(C11H24O4Si1)]
dipole: -0.2647139 -0.2880456 -0.5708947 debye
polarizability: 192.8970692|-3.2106269|142.6174969|1.5618817|2.6097826|138.0985231 unknown
InChI: InChI=1S/C11H24O4Si/c1-5-13-11(12)9-8-10-16(4,14-6-2)15-7-3/h5-10H2,1-4H3
charge 0 multiplicity 1
40 atoms
Si 2.168888 -0.364207 0.507574
O  2.414519 1.354509 0.627627
O  3.391423 -1.088505 -0.496944
O  -4.389941 -0.435467 -0.604905
O  -3.347808 0.55737 1.228317
C  0.552624 -0.77907 -0.407414
C  -0.721655 -0.230468 0.280216
C  2.271937 -0.938045 2.307663
C  -1.996468 -0.584761 -0.511674
C  2.375646 2.293421 -0.499085
C  4.828384 -1.09654 -0.194182
C  -3.268711 -0.082175 0.154005
C  2.579574 3.705522 0.05333
C  5.552542 -1.785563 -1.352258
C  -5.715708 -0.004954 -0.060394
C  -6.776203 -0.514686 -1.030839
H  0.495654 -1.881449 -0.508952
H  0.634768 -0.38474 -1.440766
H  -0.814203 -0.634493 1.30644
H  -0.656686 0.868208 0.396263
H  3.230012 -0.627708 2.760772
H  1.461474 -0.482708 2.903848
H  2.188138 -2.036583 2.3853
H  -1.954177 -0.166537 -1.536517
H  -2.086573 -1.681045 -0.642586
H  3.171629 2.038732 -1.229887
H  1.397875 2.219742 -1.023416
H  5.010297 -1.641038 0.757201
H  5.193244 -0.055777 -0.065728
H  1.784385 3.95149 0.778049
H  3.551436 3.775666 0.571766
H  2.558978 4.451347 -0.763652
H  5.18072 -2.817476 -1.475214
H  5.372479 -1.240121 -2.294772
H  6.642484 -1.821085 -1.16561
H  -5.829008 -0.428289 0.954171
H  -5.714089 1.096794 0.026887
H  -6.626354 -0.08921 -2.037849
H  -6.741699 -1.61475 -1.109786
H  -7.781228 -0.222448 -0.675397
