program: Gaussian 09
title: 000085231
version: EM64L-G09RevD.01
frameworkgroup: C1[X(C13H12NO2)]
method: RPBEPBE
basis: SDD
operation: Freq
keyword: #p
keyword: freq=noraman
keyword: PBEPBE/SDD
title: #p freq=noraman PBEPBE/SDD
converged: YES YES NO NO
title: Mulliken charges:
elementType: O O N C C C C C C C C C C C C C H H H H H H H H H H H H
charge: -0.431469 -0.184868 -0.075219 -0.526597 0.420944 -0.214250 -0.094438 0.230647 -0.391568 -0.348135 -0.178315 -0.220833 -0.216066 -0.219544 -0.212876 0.168068 0.258593 0.297688 0.323178 0.319380 0.250356 0.242399 0.286634 0.320349 0.256914 0.254940 0.259472 0.424616
chargesum: 1.00000
title: Mulliken charges with hydrogens summed into heavy atoms:
elementType: O O N C C C C C C C C C C C C C
charge: -0.006853 -0.184868 -0.075219 0.029684 0.420944 0.108927 0.224942 0.230647 -0.141212 -0.105736 0.108319 0.099516 0.040848 0.035396 0.046596 0.168068
polarizability: 2.13523393e+02 -1.31669544e+01 1.20649154e+02 4.18275814e+00 1.41464735e-01 1.04184409e+02
1716.lowfreq: -7.2143 0.0004 0.0005 0.0007 1.1738 7.7902 14.5750 42.8305 56.0823
frequency: 14.0858 42.7969 56.0710 70.7767 141.0868 153.7198 190.0517 234.0267 275.8691 322.2626 373.3025 401.7377 410.4019 450.5497 464.5656 488.1419 553.0674 609.7530 615.3465 617.7097 633.4984 683.1178 703.0538 715.4120 721.8343 768.8129 820.6324 843.7996 858.7436 862.4480 929.1367 943.2000 954.6829 983.2309 988.7203 990.1076 1015.5293 1016.6794 1025.9995 1026.9028 1033.7244 1091.0072 1096.8622 1116.4225 1167.8328 1184.7083 1194.0292 1199.5261 1217.5902 1225.5076 1301.8452 1321.4180 1333.9657 1339.3795 1378.6456 1388.9053 1440.8915 1445.7048 1459.4729 1483.1491 1488.2176 1580.9680 1593.9742 1609.0277 1618.2013 1663.9080 3024.9850 3091.9840 3122.5928 3125.0290 3152.0439 3164.8419 3172.7889 3179.6872 3188.3231 3195.4072 3204.5810 3531.7552
redmass: 5.0187 4.0642 6.6654 6.2852 6.3738 4.5230 3.9679 4.5937 6.1594 2.1424 7.1269 2.7960 2.8809 3.9952 3.6578 6.4214 5.2491 4.6953 3.5885 2.8081 1.9068 2.8580 2.7737 2.3910 3.1615 2.1772 3.1915 1.5353 1.4742 3.2052 1.4812 1.4638 1.6554 1.3935 1.4052 5.6392 1.3593 5.3588 2.2377 1.3854 3.5715 1.8347 1.8551 1.6127 2.0372 1.0574 1.1151 1.1500 1.5660 1.7038 1.4652 1.6054 1.4699 2.2792 2.3132 7.7349 2.1070 2.1392 1.2324 2.2875 2.2954 5.8702 5.9210 5.9133 5.8261 9.9658 1.0592 1.1063 1.0904 1.0904 1.0895 1.0952 1.0932 1.1013 1.0928 1.0956 1.1008 1.0650
irintensity: 1.4162 0.4458 0.8988 1.2860 1.8470 1.5908 0.9104 3.0801 3.5285 1.6450 13.2920 0.2376 7.2912 1.5659 4.3726 10.7907 22.9224 31.5163 22.3701 45.3649 98.6490 1.2090 15.1709 68.2472 79.5974 38.5922 6.8984 24.6682 7.3642 17.7289 2.2686 4.1938 6.7685 0.5367 0.3768 4.8126 0.5711 8.4068 3.1457 0.6695 226.0457 19.4243 42.1908 46.3827 61.6007 0.0710 3.0101 17.1122 20.2342 8.9484 2.3813 15.0051 25.3925 67.5310 8.1893 1.7153 41.8800 10.5725 9.6893 31.8536 9.2080 14.2052 2.9641 3.3712 1.3627 237.5600 7.9006 1.0499 5.5685 6.6676 1.1499 9.6518 4.0949 7.1331 17.5957 10.9842 3.4964 119.9612
temp: 298.150 k
press: 1.00000 atm
elementType: 8 8 7 6 6 6 6 6 6 6 6 6 6 6 6 6 1 1 1 1 1 1 1 1 1 1 1 1
symmnumber: 1
zpe: 580785.6 jmol-1
zpe.correction: 0.221210 hartree
zpe.thermalcorrener: 0.234616 hartree
zpe.thermalcorrenthalpy: 0.235560 hartree
zpe.thermalcorrgfe: 0.178769 hartree
zpe.sumelectzpe: -706.427307 hartree
zpe.sumelectthermal: -706.413900 hartree
zpe.sumelectthermalent: -706.412956 hartree
zpe.sumelectthermalfe: -706.469747 hartree
dipole: 0.0477 0.2073 -1.1092
dipole: 1.1294
quadrupole: -53.8029 -74.1417 -83.0730
quadrupole: -10.9091 -1.8645 -0.6373
quadrupole: 16.5363 -3.8025 -12.7338 -10.9091 -1.8645 -0.6373
hfenergy: -706.6485164 hartree
pointgroup: C01 [X(C13H12N1O2)]
dipole: -0.0146114 -0.3694976 -0.2463592 debye
polarizability: 210.0902517|-16.2828653|113.4281536|15.1547821|-10.0813255|114.8385501 unknown
InChI: InChI=1S/C13H12NO2/c15-13(16)12-7-4-8-14(10-12)9-11-5-2-1-3-6-11/h1-8,10,15H,9H2
charge 1 multiplicity 1
28 atoms
O  -3.929488 1.359366 -1.673353
O  -5.11877 0.316136 0.049139
N  -0.349486 -0.2654 -0.486255
C  0.901564 0.040421 -1.329658
C  2.179168 0.055221 -0.5215
C  -1.554176 0.264847 -0.872982
C  -0.257807 -1.09045 0.609012
C  -2.725109 -0.028098 -0.153238
C  3.099121 -1.019195 -0.629476
C  2.477364 1.150451 0.331763
C  -1.402992 -1.414944 1.353044
C  -2.653907 -0.880783 0.976212
C  4.303966 -1.000596 0.109215
C  3.677335 1.164228 1.073592
C  4.591325 0.08833 0.963814
C  -4.054155 0.547563 -0.554282
H  0.702576 1.016265 -1.804043
H  0.933046 -0.733702 -2.116608
H  -1.571598 0.914421 -1.750772
H  0.740462 -1.457557 0.856204
H  2.889135 -1.858386 -1.304657
H  1.784079 1.997846 0.406329
H  -1.303967 -2.075004 2.217433
H  -3.570276 -1.103803 1.532229
H  5.016445 -1.825691 0.012307
H  3.907877 2.013945 1.723908
H  5.526485 0.105476 1.532693
H  -4.807019 1.742691 -1.94487
