program: Gaussian 09
title: 000085200
version: EM64L-G09RevD.01
frameworkgroup: C1[X(C10H10Cl2O3)]
method: RPBEPBE
basis: SDD
operation: Freq
keyword: #p
keyword: freq=noraman
keyword: PBEPBE/SDD
title: #p freq=noraman PBEPBE/SDD
converged: NO YES NO NO
title: Mulliken charges:
elementType: Cl Cl O O O C C C C C C C C C C H H H H H H H H H H
charge: -0.014764 -0.018135 -0.288702 -0.259530 -0.249695 0.264133 -0.348336 -0.374071 0.528348 -0.244008 -0.235734 0.194975 -0.221450 -0.672547 -0.512663 0.298018 0.298145 0.232645 0.233486 0.230942 0.215775 0.232003 0.232510 0.233388 0.245268
chargesum: 0.00000
title: Mulliken charges with hydrogens summed into heavy atoms:
elementType: Cl Cl O O O C C C C C C C C C C
charge: -0.014764 -0.018135 -0.288702 -0.259530 -0.249695 0.264133 -0.050318 -0.075925 0.528348 -0.244008 -0.235734 0.194975 0.244680 0.006173 0.198503
polarizability: 2.05240961e+02 -4.36118457e-01 1.59482507e+02 -6.55091913e-01 -5.40918960e-01 6.88104420e+01
1716.lowfreq: -0.0021 -0.0018 0.0010 5.0962 6.5886 8.0900 24.5477 36.6453 63.2764
frequency: 24.4432 36.5104 63.2172 70.4360 78.0355 92.5762 142.3289 147.7080 171.5987 187.1521 203.7060 207.2326 249.9175 258.1833 284.9569 334.4110 346.1658 370.2389 402.0782 487.7451 506.2424 558.3259 564.0454 634.9127 725.0023 745.6902 753.6551 764.1282 799.7087 816.7604 885.5171 910.9849 922.5620 946.1660 1022.3649 1051.8697 1090.4731 1106.3980 1113.4099 1136.2573 1149.0188 1184.4098 1212.3724 1250.7569 1256.5675 1349.6842 1359.7516 1388.1999 1403.9697 1418.0115 1459.4405 1463.5586 1464.5803 1464.7617 1473.1671 1486.0561 1544.3485 1593.8561 1618.8434 2980.8614 2997.7182 3013.7383 3072.9879 3080.1888 3093.9890 3109.8134 3138.0095 3174.2446 3192.6581
redmass: 2.8516 4.2636 3.0264 4.3938 4.9093 4.8300 1.1382 3.0859 15.6055 6.0899 3.6670 4.4430 1.3731 8.5114 6.1168 10.3375 17.6507 3.9856 6.9999 7.5756 5.1769 4.9999 5.1055 7.5077 6.7238 6.0207 10.7832 6.0148 1.1040 3.9506 7.3794 1.4180 1.4634 9.1572 2.3188 3.1544 5.1287 1.2280 2.2328 1.4672 1.3290 1.5817 2.1338 1.1311 6.5600 5.2697 1.4084 5.3049 1.2672 1.6079 1.9987 1.0818 1.0398 1.0556 1.0643 1.0694 9.5781 7.3951 11.7126 1.0303 1.0360 1.0583 1.1067 1.1059 1.0984 1.1028 1.1021 1.0930 1.0930
irintensity: 6.0735 0.9712 1.6069 0.8578 0.2202 0.1037 0.4594 2.8176 0.1718 3.4915 4.2430 1.3086 1.4512 4.7065 9.2476 9.7288 1.5779 4.3576 3.8565 9.8610 0.0139 1.5894 1.8273 27.9740 20.0555 5.2041 103.2693 12.7027 2.8100 1.4182 62.2356 9.9778 18.3433 56.8483 68.0357 26.6144 219.3523 0.0501 2.5116 6.0532 12.1591 6.1752 126.0783 0.0511 567.8962 23.8775 14.0469 43.0375 25.1806 16.9706 54.5688 5.2122 12.8193 12.6213 5.2918 11.3536 72.6373 8.1472 177.4670 56.7255 19.3563 18.4296 6.3429 25.1030 29.0488 43.0788 19.4617 4.0912 2.7792
temp: 298.150 k
press: 1.00000 atm
elementType: 17 17 8 8 8 6 6 6 6 6 6 6 6 6 6 1 1 1 1 1 1 1 1 1 1
symmnumber: 1
zpe: 470184.3 jmol-1
zpe.correction: 0.179084 hartree
zpe.thermalcorrener: 0.195206 hartree
zpe.thermalcorrenthalpy: 0.196150 hartree
zpe.thermalcorrgfe: 0.133029 hartree
zpe.sumelectzpe: -1531.724592 hartree
zpe.sumelectthermal: -1531.708470 hartree
zpe.sumelectthermalent: -1531.707526 hartree
zpe.sumelectthermalfe: -1531.770647 hartree
dipole: 1.5681 1.6952 1.8765
dipole: 2.9755
quadrupole: -81.6108 -108.9348 -100.9349
quadrupole: 4.1930 -7.2650 1.7582
quadrupole: 15.5494 -11.7746 -3.7748 4.1930 -7.2650 1.7582
hfenergy: -1531.9036759 hartree
pointgroup: C01 [X(C10H10Cl2O3)]
dipole: -0.6003859 -0.7393403 0.680697 debye
dipolederiv: -0.4017697 -0.3271523 -0.0133177 -0.3527139 -0.4786199 -0.0094705 -0.0323564 -0.0249455 -0.0441495 -0.1681203 0.1747241 0.0139828 0.2248811 -0.6938954 -0.0731672 0.0084851 -0.0514133 -0.0517537 -1.6879482 -0.4193053 -0.0343396 -0.7443624 -0.753019 -0.0407887 -0.0497171 -0.0371128 -0.2771591 -1.50256 0.2400636 -0.3000804 0.2439822 -0.3724991 0.0668342 -0.1392337 0.0334793 -0.3907485 -0.8712531 0.2506363 0.0196502 0.0767042 -0.902852 -0.0483144 0.0142862 -0.055851 -0.3212607 -0.7167312 0.1236405 0.0029017 0.1231968 0.048655 0.0058428 0.0224164 0.0018582 -0.01758 -0.0054537 0.1030845 0.0037978 -0.0681394 -0.2383817 -0.0210958 -0.017125 -0.0086226 -0.0688072 -0.0791889 -0.1981344 -0.0146513 0.0302267 -0.1608143 0.001534 -0.006649 -0.004804 -0.0668856 1.1166531 -0.2623745 0.1312139 -0.2634774 -0.1013008 -0.0431906 -0.1408019 0.0121185 0.0191259 0.3957657 0.5747765 -0.01114 0.7647382 0.6035233 0.0329323 0.043744 0.0476031 -0.0684947 -0.0675943 -0.2598526 -0.0613278 -0.4816569 1.0181628 0.1180104 -0.0536323 0.0877032 -0.0611809 2.2027183 -0.0522767 -0.0022033 0.4572497 1.2795507 0.0892653 0.0119544 0.094566 0.2379508 1.0829302 0.2048445 0.0159911 0.1122946 0.2722289 -0.0071207 0.0029738 -0.0090785 0.3517222 -0.0804544 -0.0944563 -0.0077067 -0.0725696 -0.0559496 -0.0101339 -0.0048414 -0.0100315 0.0589745 0.623426 -0.0771203 0.210817 -0.0914256 0.3034191 -0.0564985 0.4652149 -0.1042085 0.4813272 0.1256755 -0.0436919 -0.0037757 -0.0581688 0.0669168 -0.0057432 -0.0001131 -0.0070202 0.1599534 0.1473576 0.0362673 0.0017616 0.0037151 0.05606 -0.0087205 0.0021536 -0.0104101 0.1629936 -0.0763958 -0.0414999 -0.0023236 0.0343987 0.0199456 -0.0854547 0.0465045 -0.0813324 -0.0717609 -0.0757368 -0.0392927 -0.006272 0.0440814 -0.0118868 0.0949913 -0.0382223 0.0921558 -0.0368661 0.1178137 0.0587755 -0.0622044 -0.0023492 -0.0046681 0.090963 -0.0447039 0.1063513 -0.0425542 -0.1815751 0.0038672 0.0031341 0.0186156 0.0745406 -0.0043345 0.0052416 -0.0038566 0.1177892 0.1207884 0.044434 0.0681068 -0.0115959 0.0297404 -0.0770737 0.0392542 -0.0935397 -0.0778596 0.0428203 -0.0894723 0.037672 -0.0120006 -0.0541619 0.1177678 -0.076712 0.0821738 -0.0174323 0.0696522 0.0402765 -0.0043933 -0.0249227 -0.0537052 -0.1276797 -0.1005308 -0.0504365 -0.0389308 -0.1308197 0.0492387 0.0147069 0.0492981 0.1090104 0.0006456 0.0424102 -0.005346 0.0635869 unknown
polarizability: 205.0506344|1.6357764|159.1614736|4.1291153|6.0051025|69.3218014 unknown
InChI: InChI=1S/C10H10Cl2O3/c1-3-15-10(13)6-4-7(11)9(14-2)8(12)5-6/h4-5H,3H2,1-2H3
charge 0 multiplicity 1
25 atoms
Cl 2.911358 2.552308 0.016089
Cl 1.76467 -2.881155 -0.386062
O  -2.877755 -0.31916 -0.109231
O  3.532081 -0.405837 -0.344661
O  -2.506158 1.974847 0.089945
C  -0.611054 0.448915 -0.074227
C  -0.175868 -0.8948 -0.18964
C  0.332089 1.504734 -0.009332
C  2.177152 -0.130252 -0.187025
C  1.700064 1.202985 -0.062651
C  1.200636 -1.161352 -0.23891
C  -2.060157 0.806136 -0.020679
C  -4.351943 -0.058858 -0.068381
C  -5.041767 -1.413176 -0.183957
C  4.295858 -0.639182 0.90701
H  -0.908638 -1.702628 -0.239625
H  -0.02375 2.534989 0.079275
H  -4.582388 0.45846 0.880252
H  -4.603436 0.620879 -0.902174
H  -4.757121 -2.075292 0.651421
H  -6.138027 -1.275339 -0.159082
H  -4.777265 -1.912103 -1.131803
H  3.895809 -1.519243 1.44254
H  4.262305 0.25826 1.551065
H  5.327204 -0.831636 0.57914
