program: Gaussian 09
title: 000085187
version: EM64L-G09RevD.01
frameworkgroup: C1[X(C6H13O9P)]
method: RPBEPBE
basis: SDD
operation: Freq
keyword: #p
keyword: freq=noraman
keyword: PBEPBE/SDD
title: #p freq=noraman PBEPBE/SDD
converged: NO YES NO NO
title: Mulliken charges:
elementType: P O O O O O O O O O C C C C C C H H H H H H H H H H H H H
charge: 1.371668 -0.542799 -0.501392 -0.433480 -0.524283 -0.453293 -0.201500 -0.696360 -0.660089 -0.594196 -0.099642 -0.155268 -0.090324 -0.135328 -0.376158 -0.069655 0.312187 0.291316 0.229953 0.236705 0.251163 0.260624 0.401324 0.382806 0.370513 0.208007 0.372764 0.446992 0.397743
chargesum: 0.00000
title: Mulliken charges with hydrogens summed into heavy atoms:
elementType: P O O O O O O O O O C C C C C C
charge: 1.371668 -0.141475 -0.118586 -0.062966 -0.524283 -0.080528 -0.201500 -0.249367 -0.262345 -0.594196 0.212546 0.136047 0.139629 0.101377 0.135629 0.138352
polarizability: 1.25040874e+02 8.44291411e+00 1.20678663e+02 -4.57936429e+00 -6.43406666e+00 1.04503830e+02
1716.lowfreq: -14.7611 -8.1162 -0.0010 -0.0007 -0.0003 7.8213 19.9507 33.4583 53.8185
frequency: 19.8385 32.8064 53.7380 63.8032 87.8784 121.4456 123.3203 142.0221 162.1414 171.9209 184.7403 191.0451 211.4874 235.6353 263.7703 283.4616 292.9196 304.3014 324.5130 358.1763 370.7853 383.9710 421.6480 432.3756 454.5585 472.3673 511.1477 546.8393 582.1505 602.9087 639.3445 682.4304 712.3546 731.9006 788.3690 800.8511 854.9644 858.8185 865.2796 920.4564 946.8036 962.9599 992.8808 1000.5115 1017.3846 1063.6933 1066.4466 1095.0929 1098.7197 1109.8409 1147.6914 1174.0233 1213.8733 1229.5054 1251.3746 1257.3120 1263.3711 1315.5324 1329.4497 1339.3526 1348.1023 1355.3659 1364.2549 1377.5000 1382.2583 1387.9220 1448.1819 1613.4837 2807.1982 2934.5369 2989.2540 3014.4821 3029.4925 3051.7323 3071.4240 3092.4277 3401.5946 3475.2317 3525.4014 3596.7981 3628.3865
redmass: 8.6946 7.7828 10.2693 6.6287 7.2437 4.3227 5.9638 6.6219 4.9396 2.4154 3.5338 2.6076 2.1013 3.5019 5.5361 2.8056 4.6427 3.5390 5.9411 7.0588 6.2087 5.3468 4.9502 2.8284 4.5775 1.1548 1.2127 4.4112 2.8511 1.2441 4.2688 4.7998 7.7897 3.6025 6.7155 3.7655 2.4435 1.4550 3.0168 3.1165 2.8846 3.1673 2.3216 3.4205 1.5753 2.8300 2.7478 3.0928 2.0141 2.6095 1.2784 1.1687 1.3673 1.3606 1.2919 1.2823 1.2390 1.3005 1.2279 1.1455 1.2706 1.4708 1.2826 1.3939 1.2952 1.2905 1.0762 8.3389 1.0750 1.0812 1.0899 1.0647 1.0791 1.0871 1.0868 1.1067 1.0646 1.0650 1.0658 1.0661 1.0677
irintensity: 1.1470 0.9081 0.7103 3.3680 8.0501 4.3860 6.2444 1.8714 21.5422 47.9116 33.5092 55.9066 31.9363 14.1590 6.5752 54.3276 25.9282 35.3356 14.7112 68.1020 4.1164 23.6405 10.8838 5.9676 18.0560 164.2452 88.2618 81.3690 57.7384 203.3657 31.9883 22.2859 186.4400 34.9857 140.5902 10.9608 72.8505 121.4170 48.3625 152.5199 33.0624 80.5105 37.1570 46.2231 11.1949 24.2983 100.9651 147.3873 64.8276 1.4292 19.5397 25.1924 45.0968 42.1902 10.5078 8.2068 3.3704 32.8080 18.4060 69.1909 9.2292 15.4411 3.1009 7.2421 57.0676 85.2662 15.0648 108.9916 1539.3550 25.3408 51.4525 3.7081 42.9326 3.6643 5.9588 8.0949 41.6031 69.3576 20.2093 79.7004 38.7649
temp: 298.150 k
press: 1.00000 atm
elementType: 15 8 8 8 8 8 8 8 8 8 6 6 6 6 6 6 1 1 1 1 1 1 1 1 1 1 1 1 1
symmnumber: 1
zpe: 550481.6 jmol-1
zpe.correction: 0.209667 hartree
zpe.thermalcorrener: 0.228507 hartree
zpe.thermalcorrenthalpy: 0.229451 hartree
zpe.thermalcorrgfe: 0.161769 hartree
zpe.sumelectzpe: -1253.332287 hartree
zpe.sumelectthermal: -1253.313448 hartree
zpe.sumelectthermalent: -1253.312503 hartree
zpe.sumelectthermalfe: -1253.380186 hartree
dipole: 4.0130 5.7149 -3.0498
dipole: 7.6201
quadrupole: -87.4864 -110.9865 -107.3562
quadrupole: 2.8498 -9.6795 -4.5893
quadrupole: 14.4566 -9.0435 -5.4132 2.8498 -9.6795 -4.5893
hfenergy: -1253.5419544 hartree
pointgroup: C01 [X(C6H13O9P1)]
dipole: 1.5283088 2.1946579 -1.3548382 debye
polarizability: 124.6411567|8.4098934|120.0641228|-4.4979696|-7.7497469|105.5180872 unknown
InChI: InChI=1S/C6H13O9P/c7-1-3(8)5(10)6(11)4(9)2-15-16(12,13)14/h1,3-6,8-13H,2H2
charge 0 multiplicity 1
29 atoms
P  -2.849469 -0.96484 0.065734
O  0.370288 -0.365533 -1.330228
O  2.545553 1.090009 -1.411933
O  -0.111607 2.53885 1.019615
O  -2.282057 0.638842 0.497674
O  2.470573 -0.654336 1.87584
O  2.51895 -2.753433 0.19055
O  -2.011868 -1.339732 -1.344716
O  -4.402742 -0.705059 -0.623294
O  -2.824018 -1.910934 1.333666
C  0.568291 0.502295 -0.143611
C  2.071547 0.803473 -0.034443
C  -0.272433 1.803213 -0.242162
C  2.900139 -0.386189 0.520765
C  -1.755761 1.551156 -0.546251
C  2.816991 -1.652654 -0.336997
H  0.242846 -0.08792 0.729783
H  2.209462 1.66717 0.641441
H  0.144285 2.474589 -1.017299
H  3.968294 -0.069859 0.51098
H  -1.904528 1.133104 -1.558253
H  -2.314024 2.49691 -0.446758
H  0.945238 -0.006821 -2.06001
H  2.962724 1.982242 -1.46437
H  -0.665307 2.081262 1.706867
H  3.086032 -1.556872 -1.410231
H  2.303993 -1.639191 1.943531
H  -1.011776 -1.079514 -1.39352
H  -5.143014 -0.999529 -0.033568
