program: Gaussian 09
title: 000085126
version: EM64L-G09RevD.01
frameworkgroup: C1[X(C8H9NO)]
method: RPBEPBE
basis: SDD
operation: Freq
keyword: #pfreq=noraman
keyword: PBEPBE/SDD
title: #p freq=noraman PBEPBE/SDD
converged: NO NO NO NO
title: Mulliken charges:
elementType: O N C C C C C C C C H H H H H H H H H
charge: -0.256072 -0.441959 0.484052 -0.348198 -0.438125 -0.211537 -0.197998 -0.255560 0.211647 -0.798565 0.308031 0.215317 0.307036 0.226507 0.225495 0.228743 0.237541 0.268802 0.234842
chargesum: 0.00000
title: Mulliken charges with hydrogens summed into heavy atoms:
elementType: O N C C C C C C C C
charge: -0.256072 -0.134923 0.484052 -0.040166 -0.222808 0.014970 0.027497 -0.026816 0.211647 -0.057380
polarizability: 1.43325756e+02 3.44780111e-02 1.00256463e+02 1.69774546e-02 -4.11903081e-03 4.38901552e+01
1716.lowfreq: -35.5280 -0.0007 0.0005 0.0009 8.8078 11.4259 30.0771 71.5748 94.0844
frequency: -31.7424 71.5518 94.0307 168.3146 253.1633 326.9841 334.1713 409.3750 507.0154 519.3482 583.4928 613.9333 641.2490 652.9455 698.5283 770.0449 818.0604 844.6687 918.9685 925.8926 973.4422 981.8934 987.6244 1002.5995 1028.2257 1031.3734 1089.3291 1172.3511 1189.3904 1215.9515 1260.8020 1320.6801 1374.4653 1383.2363 1423.5324 1451.4915 1469.4875 1485.6040 1510.4464 1598.9974 1614.6336 1635.6173 2983.9832 3069.9082 3103.9981 3129.4685 3131.2549 3140.9269 3162.8060 3192.9322 3518.3761
redmass: 1.1107 5.1351 3.0549 4.4365 3.7447 3.7773 6.0674 2.9340 2.7839 4.2743 3.0058 6.3922 1.1702 5.4830 1.9931 1.6944 4.4439 1.2692 1.4293 6.5415 1.3474 2.9495 2.3686 1.3044 2.0247 1.6562 1.5585 1.0536 1.1140 3.4396 1.9400 1.4881 1.2421 5.8433 2.1592 1.1525 1.0473 2.3222 2.0004 5.5960 5.8278 5.2244 1.0380 1.0985 1.0885 1.0867 1.0980 1.0934 1.0997 1.0952 1.0764
irintensity: 0.0120 7.3545 1.3261 6.6907 1.0147 0.7158 0.8662 0.0147 25.4612 14.3175 0.7097 0.7428 46.9728 0.7001 52.5453 95.8371 0.2868 0.1699 14.6735 6.0907 0.1474 5.4717 13.3448 3.7426 10.1432 7.9629 14.8751 0.6635 3.3042 47.0891 37.6889 68.0339 37.1051 82.2258 121.8166 14.5815 19.7404 63.7799 268.2331 40.3529 51.5221 136.5680 9.1054 16.1105 16.6401 0.3727 7.3498 32.3430 22.8917 7.0712 11.2527
temp: 298.150 k
press: 1.00000 atm
elementType: 8 7 6 6 6 6 6 6 6 6 1 1 1 1 1 1 1 1 1
symmnumber: 1
zpe: 399472.4 jmol-1
zpe.correction: 0.152151 hartree
zpe.thermalcorrener: 0.160520 hartree
zpe.thermalcorrenthalpy: 0.161464 hartree
zpe.thermalcorrgfe: 0.118450 hartree
zpe.sumelectzpe: -439.517862 hartree
zpe.sumelectthermal: -439.509493 hartree
zpe.sumelectthermalent: -439.508549 hartree
zpe.sumelectthermalfe: -439.551562 hartree
dipole: 0.0371 -3.8565 0.0102
dipole: 3.8567
quadrupole: -51.2973 -55.3073 -62.8976
quadrupole: -8.7310 0.0234 0.0105
quadrupole: 5.2034 1.1934 -6.3969 -8.7310 0.0234 0.0105
hfenergy: -439.6700126 hartree
pointgroup: C01 [X(C8H9N1O1)]
dipole: -0.0369404 -1.5168803 0.0039924 debye
dipolederiv: -0.6984151 0.0309199 -0.0000777 -0.5333781 -0.9155261 0.0011709 -0.0018873 0.000741 -0.3427536 -1.8109629 -0.1484064 0.0001979 -0.2984247 -0.3558858 -0.0005935 0.0003254 0.0000118 -0.3298144 1.1392064 -0.115452 -0.0011911 -0.3883764 0.0609826 0.0003377 -0.0017425 0.0003723 0.1074531 -0.243364 0.0278501 -0.0000953 0.2323627 -0.094466 -0.0000269 -0.0003935 0.0000423 -0.1738863 -0.3062005 0.027105 -0.0000032 -0.1311471 0.0567911 0.0002197 0.0002403 0.0001835 -0.2186364 0.0786335 -0.004328 -0.0002152 -0.071828 0.1693118 0.0002212 -0.0001506 0.0001171 -0.1439661 0.1045557 0.0063162 -0.0002916 0.0961511 0.1091411 0.0001086 -0.0001702 0.0000976 -0.1412759 -0.0356674 -0.0496112 -0.0002748 -0.0445849 -0.1417387 0.0000568 -0.0001719 0.0000685 -0.1889452 1.7992063 0.1129209 0.0020741 0.8264468 1.157532 -0.0025027 0.0090825 -0.0032892 0.1679711 -0.3727216 0.1528491 -0.0004833 0.2752504 -0.1374012 0.0042828 -0.0114193 0.0070941 0.0608091 0.1377566 -0.0663217 0.0001156 -0.0384427 0.0760784 -0.0000814 0.0000824 0.0000574 0.184765 0.0419663 0.1027695 0.0002283 0.0774684 -0.1032202 -0.00022 0.0001256 -0.0002805 0.168415 0.1588817 -0.0224203 0.0001596 0.0366423 0.085129 -0.0001579 0.000468 -0.0006424 0.3036282 0.0593216 0.0502018 0.0001288 0.0738852 -0.1043115 -0.0002247 0.0001911 -0.000197 0.1533491 -0.0236623 -0.1029103 0.0001094 -0.1190457 -0.0298041 -0.0000144 0.0001046 0.0000061 0.157932 -0.1246559 0.0497467 0.0003178 0.0504276 0.0780103 -0.0001078 0.0003021 -0.0000961 0.1706403 0.0559854 0.0021027 0.0323853 0.0380648 0.0352077 0.1020884 -0.0198735 0.1095182 -0.0388025 -0.0166457 -0.0492123 0.0039334 -0.1175011 0.0331903 0.004288 0.0078233 0.0020682 0.1306601 0.0567821 -0.0041197 -0.0370178 0.0360293 0.0209794 -0.1088448 0.0170637 -0.1158729 -0.0275426 unknown
polarizability: 143.2783869|-1.4279688|100.303832|-0.0168258|-0.0032101|43.890155 unknown
InChI: InChI=1S/C8H9NO/c1-7(10)9-8-5-3-2-4-6-8/h2-6,9H,1H3
charge 0 multiplicity 1
19 atoms
O  2.312434 1.342133 -0.004009
N  1.165364 -0.710782 -0.003615
C  -0.199605 -0.300165 -0.002014
C  -0.601319 1.063231 -0.000602
C  -1.186162 -1.324944 -0.001698
C  -1.978605 1.374925 0.001032
C  -2.556146 -0.99508 0.000018
C  -2.96335 0.360094 0.001372
C  2.32252 0.077331 -0.003379
C  3.616237 -0.742279 0.001137
H  0.16107 1.8442 -0.00096
H  -0.878783 -2.379938 -0.002681
H  1.314629 -1.72321 -0.004156
H  -2.280567 2.42874 0.002031
H  -3.303208 -1.796976 0.000322
H  -4.027791 0.618183 0.002639
H  3.695057 -1.360175 0.915403
H  4.468295 -0.047557 -0.029576
H  3.671931 -1.41353 -0.876364
