program: Gaussian 09
title: 000085058
version: EM64L-G09RevD.01
frameworkgroup: C1[X(C8H8F6O3)]
method: RPBEPBE
basis: SDD
operation: Freq
keyword: #pfreq=noraman
keyword: PBEPBE/SDD
title: #p freq=noraman PBEPBE/SDD
converged: YES YES NO NO
title: Mulliken charges:
elementType: F F F F F F O O O C C C C C C C C H H H H H H H H
charge: -0.152643 -0.109443 -0.155714 -0.128433 -0.119626 -0.165091 -0.382511 -0.134202 -0.212196 0.007028 -0.424515 0.382243 0.374969 0.227393 0.301068 -0.771454 -0.773079 0.285824 0.395707 0.276514 0.268914 0.233343 0.267909 0.236938 0.271058
chargesum: 0.00000
title: Mulliken charges with hydrogens summed into heavy atoms:
elementType: F F F F F F O O O C C C C C C C C
charge: -0.152643 -0.109443 -0.155714 -0.128433 -0.119626 -0.165091 0.013196 -0.134202 -0.212196 0.007028 -0.138691 0.382243 0.374969 0.227393 0.301068 0.007317 0.002826
polarizability: 9.81520230e+01 -3.55801832e-01 9.99258082e+01 2.98050261e+00 2.39624260e+00 9.62816041e+01
1716.lowfreq: -6.2932 -0.0010 -0.0008 -0.0006 0.7524 10.0398 32.9170 55.2181 65.0544
frequency: 32.7409 55.2083 65.0255 82.5875 90.9989 121.8588 133.9512 137.2084 159.4158 164.3044 171.4756 201.4109 237.2309 246.7063 269.8247 279.4371 296.2523 305.7934 328.0728 341.3422 412.2916 458.1286 458.7975 477.7076 489.2545 514.1986 553.9515 558.4616 606.2449 622.6359 650.1417 678.4731 768.3981 784.9226 846.6650 888.7150 945.8057 956.1723 977.8038 986.5098 1016.3849 1029.5086 1040.7326 1060.6513 1086.3109 1102.4053 1135.2449 1152.6434 1161.8474 1191.8000 1239.2085 1318.1764 1375.2236 1378.1405 1429.0431 1440.3209 1443.2168 1449.7587 1453.2939 1611.1916 1660.4877 2983.9304 2985.8683 3065.2797 3070.6386 3080.7250 3114.1227 3131.6036 3132.3237
redmass: 15.2080 5.7380 7.0057 4.7411 4.5936 3.5354 1.1764 1.1183 8.9677 9.8095 7.2137 9.3193 9.8520 7.9219 16.4156 10.0973 10.6881 14.5014 3.9551 4.8370 10.7066 12.8476 12.5034 5.0418 8.2110 4.8535 10.5316 3.8198 2.7832 10.9014 13.1358 1.1631 4.4375 4.9645 4.6999 5.3738 2.8104 2.4884 8.8943 2.1742 2.1087 4.9010 2.4285 9.1347 9.1922 7.9661 2.6009 9.5173 5.4882 2.4773 1.5325 1.4097 1.2391 1.2336 1.3395 1.1112 1.0630 1.0554 1.0521 5.4842 8.4673 1.0381 1.0384 1.0960 1.0943 1.0858 1.0692 1.0995 1.1005
irintensity: 0.4561 1.4975 0.5139 0.8939 5.0020 0.1458 0.5533 0.2311 4.5581 1.1290 4.8639 2.0421 1.3174 2.5599 0.5413 1.7629 0.2983 1.2877 3.9389 4.3868 3.8484 9.4937 8.8786 2.4286 0.8336 4.8251 7.8685 41.0383 24.9282 16.3716 5.5479 53.6305 7.4798 9.7789 4.5148 180.5111 51.0668 52.2819 28.2030 6.6997 36.2208 100.0681 10.1140 236.1761 104.1388 28.7071 28.1445 323.5676 251.3213 55.3002 171.9773 61.6431 35.6437 87.5388 124.4555 23.2390 23.9830 22.3789 18.4494 30.2993 113.0443 1.5905 2.2417 5.1198 3.3807 1.8207 315.7969 17.0829 5.9693
temp: 298.150 k
press: 1.00000 atm
elementType: 9 9 9 9 9 9 8 8 8 6 6 6 6 6 6 6 6 1 1 1 1 1 1 1 1
symmnumber: 1
zpe: 410894.6 jmol-1
zpe.correction: 0.156501 hartree
zpe.thermalcorrener: 0.174520 hartree
zpe.thermalcorrenthalpy: 0.175464 hartree
zpe.thermalcorrgfe: 0.110522 hartree
zpe.sumelectzpe: -1133.040313 hartree
zpe.sumelectthermal: -1133.022295 hartree
zpe.sumelectthermalent: -1133.021351 hartree
zpe.sumelectthermalfe: -1133.086293 hartree
dipole: 3.9794 -0.4262 5.1269
dipole: 6.5040
quadrupole: -97.0591 -97.1446 -100.7482
quadrupole: -2.2080 10.2037 1.9592
quadrupole: 1.2582 1.1727 -2.4309 -2.2080 10.2037 1.9592
hfenergy: -1133.196815 hartree
pointgroup: C01 [X(C8H8F6O3)]
dipole: 1.4678163 0.2743172 -2.0780188 debye
dipolederiv: -0.3886476 0.0353656 -0.1653802 0.0613114 -0.324802 0.0167306 -0.1733326 -0.0620354 -0.74198 -0.75966 0.0991733 0.2210163 0.1952707 -0.3093328 -0.0412821 0.1930024 0.0005666 -0.3532593 -0.5488698 -0.0723706 -0.028187 -0.2245045 -0.7100114 -0.0183319 -0.01056 0.0268774 -0.2509783 -0.4511737 0.0625197 -0.07191 0.171107 -0.610092 0.1914447 -0.095035 0.1320757 -0.3257092 -0.8265642 -0.0311367 0.1668396 -0.1392484 -0.326963 0.0221555 0.1437709 -0.0107579 -0.2767809 -0.3671632 -0.0636969 -0.0171132 -0.049146 -0.3676638 -0.1588365 0.0420879 -0.0753858 -0.7039627 -0.5814814 -0.0348535 -0.0080533 0.005997 -0.4805817 -0.0690899 -0.0847848 -0.0953402 -0.6438351 -0.4396104 0.2375314 -0.1313563 0.1418357 -0.467376 -0.0011248 -0.207112 0.1813509 -0.584959 -0.5168485 -0.2435925 0.0628725 -0.1776617 -0.4621286 -0.0709359 0.1478278 -0.2383531 -0.8022218 0.3845316 -0.0479948 0.062013 -0.0291594 0.136615 0.0667188 -0.0444965 0.0631041 0.407971 -0.3986626 0.0768674 0.0762787 0.1105238 -1.0084878 -0.1068225 0.0220956 -0.0886267 -0.0877455 1.5217494 -0.070654 -0.0635573 -0.0135418 1.2722768 0.0981408 0.0352917 0.0169042 1.2458934 1.5180995 0.0528938 -0.0847483 0.0284853 1.2827431 -0.1024648 -0.0696983 -0.0169229 1.2693874 0.5483023 -0.7045922 0.0344587 -0.5248982 1.0436745 0.2403654 0.2177032 -0.1254582 0.747736 0.4922499 0.678719 -0.0783979 0.3995771 0.9442763 -0.0124286 -0.1733355 0.2826149 0.8871389 -0.0261645 0.0904176 0.0155027 0.0847714 -0.1666956 -0.2077547 0.0436232 -0.2345205 -0.3257795 -0.0668686 -0.1501557 0.0931195 -0.1518155 -0.1334039 0.180141 0.1755083 0.218682 -0.294023 0.0690385 -0.023816 0.0005668 -0.0024533 0.1034037 0.0020283 -0.0025734 0.0085671 -0.0434553 0.5552414 0.0928913 -0.1105897 0.0976136 0.359253 -0.0223618 -0.045021 0.0271609 0.4057985 0.005115 -0.0405629 -0.0415312 -0.0178465 0.102534 -0.0290747 -0.0381365 0.0073316 0.1236009 0.0538623 0.1006909 -0.0071334 0.0906373 -0.0025641 -0.0023807 -0.0412666 0.0291617 0.0778504 0.0881719 -0.0135782 0.0766075 -0.0653052 0.0015052 0.0860054 0.04236 0.0625936 0.0373304 0.0152883 0.0508523 -0.0585703 0.0192316 0.0996509 0.0445469 -0.0607401 0.0121258 0.0913336 0.0737126 0.0118931 0.0676906 0.0738389 -0.0157495 -0.0826419 0.0343127 -0.0686341 0.0735178 0.0463516 -0.0928114 -0.0104379 -0.0846203 0.0399197 -0.0227465 -0.0514913 -0.0530819 0.0671314 unknown
polarizability: 97.8574293|0.2864878|99.9919078|-3.2164771|2.1360292|96.5100982 unknown
InChI: InChI=1S/C8H8F6O3/c1-3(15)5(4(2)16)6(17,7(9,10)11)8(12,13)14/h5,17H,1-2H3
charge 0 multiplicity 1
25 atoms
F  -1.805592 1.009793 -1.577696
F  -2.650365 1.353343 0.499788
F  -0.777663 2.431509 -0.147399
F  -0.610922 -2.397013 0.733931
F  -2.596748 -1.351148 0.516595
F  -1.278023 -1.669025 -1.300955
O  -0.43203 0.163549 1.757381
O  2.235714 -1.343094 1.005462
O  1.740721 1.59122 1.258904
C  -0.547101 0.028968 0.344304
C  0.832036 0.089105 -0.421692
C  -1.468492 1.192918 -0.212305
C  -1.269153 -1.342961 0.086089
C  1.745146 -1.17069 -0.130303
C  1.657959 1.315875 0.027767
C  2.010107 -2.078245 -1.313697
C  2.396541 2.091888 -1.03304
H  0.634585 0.130273 -1.504279
H  0.430717 0.661715 1.958003
H  1.060992 -2.482598 -1.709745
H  2.669122 -2.906616 -1.013663
H  2.483544 -1.508521 -2.136903
H  1.668994 2.639534 -1.662471
H  2.957721 1.413399 -1.702813
H  3.085591 2.812622 -0.568263
