program: Gaussian 09
title: 000084988
version: EM64L-G09RevD.01
frameworkgroup: C1[X(C11H16S)]
method: RPBEPBE
basis: SDD
operation: Freq
keyword: #pfreq=noraman
keyword: PBEPBE/SDD
title: #p freq=noraman PBEPBE/SDD
converged: YES YES NO NO
title: Mulliken charges:
elementType: S C C C C C C C C C C C H H H H H H H H H H H H H H H H
charge: -0.031710 0.126942 0.541843 -0.699374 -0.699510 -0.748265 -0.618693 -0.428823 0.515638 -0.229368 -0.369081 -0.828849 0.223244 0.206909 0.214755 0.214441 0.206897 0.223359 0.218048 0.216930 0.217143 0.250324 0.229998 0.220357 0.241821 0.242136 0.227797 0.115091
chargesum: 0.00000
title: Mulliken charges with hydrogens summed into heavy atoms:
elementType: S C C C C C C C C C C C
charge: 0.083381 0.126942 0.541843 -0.054467 -0.054812 -0.096144 -0.368370 -0.198825 0.515638 -0.009011 -0.369081 -0.117095
polarizability: 1.89131010e+02 -1.51977748e+00 1.34723142e+02 4.15807649e-04 -3.32157069e-02 8.22344306e+01
1716.lowfreq: -13.3307 -5.3826 -4.5760 -0.0024 -0.0019 -0.0011 40.7141 73.2235 122.1611
frequency: 40.6782 73.2115 122.1462 166.8169 168.7134 186.8167 203.7530 228.9192 236.9320 237.3351 261.9403 303.5355 308.1918 343.3068 378.3849 409.1596 432.5907 441.4452 482.6140 538.8999 573.0895 599.7394 693.4070 729.9398 799.6476 813.0634 870.0709 899.3188 914.7282 918.1030 928.1648 935.8200 944.2672 992.5919 1020.5773 1024.4490 1038.4653 1046.3383 1122.5259 1160.7093 1206.1209 1210.3249 1216.5929 1267.9389 1296.2085 1364.4131 1373.3685 1374.1447 1395.5210 1401.4152 1403.3803 1458.3050 1458.9059 1462.8449 1465.0817 1468.6541 1477.7405 1485.4688 1486.4690 1495.5950 1573.8639 1608.1175 2449.0440 2969.2494 2971.7777 2972.1940 2978.0270 3043.1093 3066.4372 3066.9932 3069.1945 3075.7606 3077.9585 3081.4716 3086.2857 3115.2111 3139.5638 3145.0231
redmass: 2.9568 4.5201 1.0196 3.6879 1.7947 1.1239 1.3792 2.4684 2.4988 1.3620 3.5547 2.8881 1.0459 2.6484 2.6937 3.1226 3.5505 2.8254 2.9672 4.0323 4.2719 3.2584 6.0161 3.1139 3.1268 1.4301 1.2756 1.4479 2.3115 1.6712 1.6708 1.2936 1.2650 1.5901 1.4296 1.3854 4.2950 1.5315 1.9572 1.5346 2.9808 2.4356 2.1747 2.0272 1.7256 7.7838 1.2699 1.1878 2.4264 1.3010 1.2492 1.5293 1.0518 1.0483 1.0439 1.1725 1.0816 1.3160 1.0510 1.0981 6.9792 6.1503 1.0381 1.0377 1.0349 1.0346 1.0358 1.0971 1.1000 1.0998 1.1005 1.0984 1.0995 1.0990 1.0984 1.0868 1.0943 1.0915
irintensity: 0.0008 0.1090 3.0441 0.3104 4.3695 20.5165 3.0613 1.7186 0.9775 0.4046 0.2487 0.2369 0.1035 0.0685 0.2235 2.3459 1.1728 5.2279 1.1363 0.5061 5.7775 10.2598 5.2531 3.3842 5.3827 28.8497 12.8343 6.2495 5.5627 4.3106 2.6461 0.0024 0.3208 4.3224 1.2528 0.0911 57.5749 8.4773 24.4666 2.9896 7.1866 5.5312 0.3547 30.5817 5.2141 6.4557 19.7101 19.2895 13.0079 10.3056 12.1239 18.1522 0.0509 0.4821 14.2625 10.8052 9.9064 33.0455 10.9907 43.9050 5.6575 3.5539 20.0886 25.1135 30.9503 34.0920 32.7327 15.8238 4.0031 3.3532 17.0403 132.0329 35.0029 46.8269 19.5698 11.7389 29.4670 4.0876
temp: 298.150 k
press: 1.00000 atm
elementType: 16 6 6 6 6 6 6 6 6 6 6 6 1 1 1 1 1 1 1 1 1 1 1 1 1 1 1 1
symmnumber: 1
zpe: 615168.7 jmol-1
zpe.correction: 0.234305 hartree
zpe.thermalcorrener: 0.248091 hartree
zpe.thermalcorrenthalpy: 0.249035 hartree
zpe.thermalcorrgfe: 0.194661 hartree
zpe.sumelectzpe: -825.913363 hartree
zpe.sumelectthermal: -825.899577 hartree
zpe.sumelectthermalent: -825.898633 hartree
zpe.sumelectthermalfe: -825.953007 hartree
dipole: -1.2715 -0.5064 0.0017
dipole: 1.3686
quadrupole: -81.1799 -73.1648 -85.9514
quadrupole: -2.9838 0.0091 -0.0122
quadrupole: -1.0812 6.9339 -5.8527 -2.9838 0.0091 -0.0122
hfenergy: -826.147668 hartree
pointgroup: C01 [X(C11H16S1)]
dipole: -0.5068292 -0.1817531 -0.0025067 debye
polarizability: 188.9508721|-3.395498|134.8895714|1.0113432|-0.4988781|82.248139 unknown
InChI: InChI=1S/C11H16S/c1-8-7-9(11(2,3)4)5-6-10(8)12/h5-7,12H,1-4H3
charge 0 multiplicity 1
28 atoms
S  3.944475 -0.658762 0.059969
C  -2.26259 0.06955 -0.003231
C  -0.72475 -0.09791 0.011447
C  -2.866761 -0.5960 1.270597
C  -2.846639 -0.625591 -1.270507
C  -2.69597 1.557935 -0.023855
C  0.170143 1.00017 0.011097
C  -0.152993 -1.398332 0.027795
C  1.580135 0.848228 0.02606
C  1.242918 -1.584658 0.042742
C  2.111051 -0.468834 0.041893
C  2.492729 2.059247 0.024259
H  -2.476048 -0.116906 2.186935
H  -3.968662 -0.495732 1.268597
H  -2.624502 -1.672564 1.322501
H  -2.606551 -1.703697 -1.291651
H  -3.948174 -0.522887 -1.289658
H  -2.439253 -0.170271 -2.191682
H  -3.799549 1.622102 -0.032922
H  -2.336416 2.102042 0.869156
H  -2.32299 2.081136 -0.92386
H  -0.222789 2.021945 -0.000743
H  -0.797712 -2.28472 0.029089
H  1.650269 -2.602917 0.055176
H  3.155533 2.065609 0.911195
H  3.151328 2.06542 -0.86592
H  1.912455 2.997101 0.025607
H  3.948715 -2.042506 0.075116
