program: Gaussian 09
title: 000084980
version: EM64L-G09RevD.01
frameworkgroup: C1[X(C11H14Cl2N2O)]
method: RPBEPBE
basis: SDD
operation: Freq
keyword: #p
keyword: freq=noraman
keyword: PBEPBE/SDD
title: #p freq=noraman PBEPBE/SDD
converged: YES YES NO NO
title: Mulliken charges:
elementType: Cl Cl O N N C C C C C C C C C C C H H H H H H H H H H H H H H
charge: -0.024920 -0.018724 -0.309562 -0.164590 -0.509233 -0.348721 -0.409049 0.289952 -0.654078 -0.647900 0.524099 -0.459808 -0.342359 -0.025527 -0.181971 -0.125532 0.207257 0.263095 0.237991 0.214908 0.250291 0.201918 0.218976 0.217102 0.231678 0.223730 0.318686 0.246451 0.320671 0.255169
chargesum: 0.00000
title: Mulliken charges with hydrogens summed into heavy atoms:
elementType: Cl Cl O N N C C C C C C C C C C C
charge: -0.024920 -0.018724 -0.309562 -0.164590 -0.190547 0.121631 0.043850 0.289952 0.017108 0.024610 0.524099 -0.213357 -0.021688 -0.025527 0.073198 -0.125532
polarizability: 2.53089410e+02 -8.08624854e-01 1.58777490e+02 4.19382868e-01 6.72555289e+00 8.30800600e+01
1716.lowfreq: -8.1047 -5.1141 -0.0030 -0.0020 -0.0018 5.5647 18.6110 33.2312 56.6885
frequency: 18.3581 33.0044 56.5326 68.5824 84.2309 100.5752 112.2430 137.6073 176.2699 186.8053 201.2506 214.1763 230.7640 249.1095 315.3683 317.5786 345.1881 382.7298 415.4548 436.4341 439.0076 466.0977 515.2075 531.4567 583.9702 597.1069 652.0331 684.9736 688.0620 702.8087 775.1072 781.9396 832.4440 834.6154 853.0984 858.5762 934.8167 966.9791 977.2901 993.6520 1042.5376 1073.2941 1081.7322 1095.3663 1121.3895 1140.6496 1154.6864 1214.1100 1239.5654 1250.5186 1283.5731 1301.4244 1336.0463 1340.2803 1361.2510 1387.4029 1389.2758 1392.6797 1399.3141 1456.4569 1465.2422 1468.7926 1470.7584 1481.0922 1482.0245 1495.2105 1508.1606 1577.2698 1606.6866 1620.2928 2976.9800 2983.2587 2984.0268 2998.5619 3044.1672 3068.2567 3081.6467 3087.5942 3089.0660 3102.6088 3139.8843 3164.2730 3200.4712 3553.4507
redmass: 4.7904 4.7596 3.5905 2.9786 6.6679 5.0163 2.9756 4.3744 21.0089 3.8164 1.3653 1.5705 4.8739 1.8914 4.9549 2.9850 4.2193 4.6235 3.3721 4.3317 3.2385 6.3275 1.9361 2.0743 4.0088 3.8014 6.7769 3.1811 6.0470 9.7941 1.3637 1.1492 1.3417 2.6442 1.6627 5.2585 2.1967 2.8957 1.3037 5.1420 2.7653 2.0227 1.8716 1.6993 2.2332 1.3269 2.2481 2.9396 1.3966 1.5815 1.8666 1.5021 1.4355 2.4606 1.2960 1.3081 1.6880 1.6946 2.7827 1.0880 1.0486 2.9582 1.0511 1.0906 1.0582 1.8730 1.2751 5.5892 6.1963 4.3707 1.0658 1.0364 1.0367 1.0660 1.0960 1.0983 1.0997 1.0973 1.1006 1.1018 1.0921 1.0910 1.0951 1.0755
irintensity: 0.4585 0.0052 0.2557 0.1792 9.1929 0.3391 2.4460 0.5863 0.0475 1.9339 0.7232 1.1947 0.3871 0.5773 1.0189 0.4502 15.1909 5.3806 5.4640 5.3493 6.7846 30.0803 51.0472 27.4550 0.4626 1.0028 9.8782 5.6583 8.0723 18.9079 15.6982 2.2825 10.5958 8.4234 67.4473 21.0851 10.3977 14.7184 3.6042 24.0812 9.6339 16.6921 19.8996 29.1916 67.5683 1.1909 112.7231 31.6486 51.1185 155.8097 56.2554 19.2516 24.8711 121.5074 12.9516 5.8058 75.4850 35.5689 140.3971 28.9592 1.8424 171.2274 9.6222 47.1504 19.8379 489.5495 62.0180 110.0327 64.4561 329.4905 33.0455 35.4919 15.4693 44.5568 9.6415 17.7798 57.5715 38.0471 24.8063 29.8408 6.6084 1.9356 14.3322 15.1021
temp: 298.150 k
press: 1.00000 atm
elementType: 17 17 8 7 7 6 6 6 6 6 6 6 6 6 6 6 1 1 1 1 1 1 1 1 1 1 1 1 1 1
symmnumber: 1
zpe: 612863.9 jmol-1
zpe.correction: 0.233428 hartree
zpe.thermalcorrener: 0.250578 hartree
zpe.thermalcorrenthalpy: 0.251522 hartree
zpe.thermalcorrgfe: 0.186190 hartree
zpe.sumelectzpe: -1531.230044 hartree
zpe.sumelectthermal: -1531.212894 hartree
zpe.sumelectthermalent: -1531.211950 hartree
zpe.sumelectthermalfe: -1531.277282 hartree
dipole: -5.9232 3.2976 0.5070
dipole: 6.7982
quadrupole: -105.8245 -106.0998 -111.9402
quadrupole: -11.5027 -1.7978 0.0461
quadrupole: 2.1303 1.8551 -3.9854 -11.5027 -1.7978 0.0461
hfenergy: -1531.4634714 hartree
pointgroup: C01 [X(C11H14Cl2N2O1)]
dipole: -2.3598435 1.2059432 0.361023 debye
polarizability: 252.7852254|2.7754929|157.8823348|-6.5335665|10.6761925|84.2794001 unknown
InChI: InChI=1S/C11H14Cl2N2O/c1-3-15(4-2)11(16)14-8-5-6-9(12)10(13)7-8/h5-7,14H,3-4H2,1-2H3
charge 0 multiplicity 1
30 atoms
Cl 4.229559 2.189851 0.338009
Cl 5.329398 -0.867645 -0.271156
O  -1.596213 -1.735737 -0.379891
N  -2.96022 0.088018 0.142506
N  -0.6058 0.355416 0.075452
C  -4.163218 -0.755479 -0.062691
C  -3.164945 1.479404 0.598015
C  -1.714701 -0.507587 -0.07204
C  -4.664078 -1.412767 1.240503
C  -3.161312 2.521558 -0.546799
C  0.765899 0.01206 -0.018017
C  1.706494 1.062286 0.168151
C  1.239037 -1.30315 -0.282088
C  3.086005 0.802754 0.091825
C  2.625209 -1.541881 -0.352143
C  3.557571 -0.500053 -0.167591
H  -4.952341 -0.120375 -0.509214
H  -3.898032 -1.537736 -0.792468
H  -4.141786 1.514173 1.113102
H  -2.417198 1.741566 1.37341
H  -3.889095 -2.08398 1.647541
H  -4.915154 -0.658641 2.009664
H  -5.5723 -2.01124 1.042464
H  -2.19719 2.544474 -1.086938
H  -3.946577 2.28524 -1.286157
H  -3.35723 3.534125 -0.148783
H  -0.792252 1.345444 0.235594
H  1.37195 2.084979 0.374771
H  0.519682 -2.108756 -0.432991
H  2.99194 -2.55232 -0.55564
