program: Gaussian 09
title: 000008207
version: EM64L-G09RevD.01
frameworkgroup: C1[X(C13H28O)]
method: RPBEPBE
basis: SDD
operation: Freq
keyword: #pfreq=noraman
keyword: PBEPBE/SDD
title: #p freq=noraman PBEPBE/SDD
converged: YES YES NO NO
title: Mulliken charges:
elementType: O C C C C C C C C C C C C C H H H H H H H H H H H H H H H H H H H H H H H H H H H H
charge: -0.452685 -0.385265 -0.385519 -0.384936 -0.382715 -0.381806 -0.375867 -0.373001 -0.377501 -0.353308 -0.365484 -0.356818 -0.342512 -0.696695 0.193164 0.193128 0.193949 0.193896 0.193111 0.193143 0.192297 0.192245 0.191686 0.191658 0.194794 0.194763 0.189416 0.189398 0.188945 0.188955 0.187482 0.187488 0.213594 0.213609 0.194782 0.194798 0.186908 0.186935 0.209551 0.214864 0.209528 0.340026
chargesum: 0.00000
title: Mulliken charges with hydrogens summed into heavy atoms:
elementType: O C C C C C C C C C C C C C
charge: -0.112659 0.001027 0.002325 0.001318 0.001827 0.001537 0.013689 0.005813 0.000400 0.021661 0.061718 0.032762 0.031331 -0.062752
polarizability: 1.98762779e+02 3.21307125e-01 1.26490369e+02 -2.48060050e-03 1.42261904e-03 1.17664992e+02
1716.lowfreq: -3.4659 -0.0013 0.0010 0.0015 8.8828 22.1062 24.9292 44.5450 51.5414
frequency: 22.2763 24.9285 47.0330 55.6436 68.9110 80.1084 81.6246 108.9827 116.1645 130.5095 136.3589 144.7433 156.5876 158.9379 161.9927 205.7222 224.4742 271.8966 284.1550 306.0330 371.8198 421.4514 450.4792 495.9131 505.7497 722.5160 723.9341 728.6952 739.6929 758.6763 784.9152 818.8462 861.0746 886.8169 908.3627 956.4005 957.9091 976.5955 985.3814 1000.4523 1004.4155 1026.7132 1034.4072 1036.3002 1059.9359 1072.7120 1077.7461 1080.7747 1082.8261 1084.8634 1122.2049 1149.9096 1181.9893 1193.9716 1200.2312 1216.1887 1224.0776 1238.1247 1248.4754 1260.5546 1270.2560 1278.4927 1283.1816 1283.7974 1286.4703 1291.8923 1295.8546 1300.4326 1301.9268 1307.0700 1328.5806 1345.2584 1353.8026 1355.4856 1357.2215 1360.4561 1387.9443 1413.9576 1460.9898 1461.1002 1463.8293 1464.1989 1466.9361 1468.9612 1471.2073 1475.2742 1475.8330 1479.4394 1483.4989 1487.2869 1490.1900 1492.1568 2925.9750 2949.6968 2949.8997 2951.2584 2951.6373 2953.1881 2954.1480 2958.1016 2962.5425 2966.4554 2969.5009 2971.6799 2973.1796 2982.6352 2985.0328 2988.4929 2992.1556 2993.1338 2999.3719 3008.2993 3018.4510 3028.3267 3037.1183 3043.7843 3059.3308 3068.2519 3070.4462 3564.1536
redmass: 4.3511 4.3155 3.6823 1.6728 3.9753 1.8178 2.4702 1.6447 2.6991 3.6905 1.7456 2.3127 4.7602 1.9307 2.1015 3.4192 1.1361 1.0875 3.5172 3.9202 3.1339 3.6418 3.0732 3.0932 3.1140 1.0583 1.0663 1.0796 1.0998 1.1212 1.1468 1.1840 1.2129 1.9044 1.2181 1.1941 7.5952 4.5470 4.4856 1.1380 3.7888 3.1789 1.0580 3.4293 2.7988 2.7760 2.4210 2.0946 2.2098 2.4108 2.7946 1.3788 1.8862 1.2173 1.6036 1.3160 1.4416 1.3146 1.3389 1.2989 1.2614 1.0251 1.0503 1.3028 1.1408 1.0904 1.1062 1.1147 1.1104 1.3322 1.3872 1.4659 1.6687 1.6177 1.6521 1.6270 1.2172 1.4397 1.0729 1.0722 1.0704 1.0674 1.0738 1.0720 1.0817 1.0818 1.0425 1.0843 1.0888 1.0930 1.0959 1.0981 1.0544 1.0585 1.0584 1.0590 1.0588 1.0589 1.0595 1.0594 1.0591 1.0585 1.0583 1.0368 1.1065 1.0959 1.0967 1.0980 1.0591 1.0997 1.1017 1.1034 1.1046 1.1051 1.1050 1.1046 1.1048 1.1007 1.0993 1.0664
irintensity: 0.0180 0.1900 0.1535 4.9253 0.5213 2.1104 0.9191 2.5379 0.0077 1.1393 1.9050 0.2667 0.0920 0.6808 0.2009 1.6071 0.0016 156.5756 3.4580 0.0296 4.1274 0.3891 6.7829 0.3192 7.0117 18.2309 0.1294 7.8391 0.3772 4.0937 0.0860 1.0756 0.2904 4.7495 0.2215 0.4229 41.1427 28.6887 1.6486 0.0578 22.5471 0.9232 0.1178 10.5586 4.6946 0.9000 2.5784 1.0637 0.0665 1.7117 11.4690 0.8030 0.1668 13.3399 0.0163 24.4279 0.0067 10.9334 0.0461 9.7205 0.4023 0.2510 1.3891 4.4660 0.0041 0.0992 0.7447 0.0399 0.0139 2.3250 1.7491 0.0994 0.9870 0.4961 0.0674 0.1204 11.2279 6.1058 0.0027 0.0101 0.0468 0.0135 0.0521 0.1889 1.2642 0.2853 12.3043 2.3703 0.6146 1.7738 18.3669 28.2557 61.4919 0.0127 0.0408 0.8411 0.5638 8.2953 0.1689 3.9032 1.3439 135.7504 228.1577 35.0649 52.7039 0.1016 0.2944 0.6959 48.9093 0.7040 0.5109 0.7289 0.0455 7.6423 0.2554 266.4057 132.2848 102.6555 55.6723 2.0915
temp: 298.150 k
press: 1.00000 atm
elementType: 8 6 6 6 6 6 6 6 6 6 6 6 6 6 1 1 1 1 1 1 1 1 1 1 1 1 1 1 1 1 1 1 1 1 1 1 1 1 1 1 1 1
symmnumber: 1
zpe: 1011792.0 jmol-1
zpe.correction: 0.385371 hartree
zpe.thermalcorrener: 0.404771 hartree
zpe.thermalcorrenthalpy: 0.405716 hartree
zpe.thermalcorrgfe: 0.335041 hartree
zpe.sumelectzpe: -586.198265 hartree
zpe.sumelectthermal: -586.178865 hartree
zpe.sumelectthermalent: -586.177920 hartree
zpe.sumelectthermalfe: -586.248595 hartree
dipole: -0.0668 1.8112 0.0017
dipole: 1.8124
quadrupole: -91.5863 -93.6370 -90.2233
quadrupole: 16.1542 0.0127 0.0023
quadrupole: 0.2293 -1.8215 1.5922 16.1542 0.0127 0.0023
hfenergy: -586.583636 hartree
pointgroup: C01 [X(C13H28O1)]
dipole: 0.0265061 -0.7125444 0.0039816 debye
polarizability: 198.7621705|0.3462921|126.4904022|0.1752857|-0.0409922|117.665568 unknown
InChI: InChI=1S/C13H28O/c1-2-3-4-5-6-7-8-9-10-11-12-13-14/h14H,2-13H2,1H3
charge 0 multiplicity 1
42 atoms
O  -8.24379 0.416007 -0.020469
C  0.631904 -0.423051 0.000585
C  -0.669995 0.409463 -0.005786
C  1.912637 0.441681 0.000018
C  -1.95036 -0.45585 -0.004725
C  3.214406 -0.391119 0.006415
C  -3.251613 0.377296 -0.010592
C  4.495619 0.473222 0.006157
C  -4.531814 -0.48851 -0.008682
C  5.797248 -0.360007 0.012961
C  -5.826612 0.355308 -0.015052
C  7.078776 0.504787 0.012659
C  -7.092419 -0.505149 -0.012692
C  8.373772 -0.336269 0.019459
H  0.642323 -1.09334 -0.884529
H  0.638217 -1.08597 0.891274
H  -0.676573 1.072266 -0.896457
H  -0.680271 1.079777 0.87921
H  1.902457 1.111857 0.885196
H  1.906472 1.10481 -0.890493
H  -1.939911 -1.126005 -0.889974
H  -1.943294 -1.118687 0.886053
H  3.224749 -1.061278 -0.878792
H  3.220448 -1.054281 0.896922
H  -3.259426 1.039543 -0.901343
H  -3.262204 1.047471 0.874179
H  4.490002 1.136184 -0.884506
H  4.485436 1.143441 0.891328
H  -4.52178 -1.150011 0.883237
H  -4.51871 -1.158585 -0.894139
H  5.809011 -1.030288 -0.872163
H  5.804439 -1.022951 0.903647
H  -5.850259 1.019311 0.870839
H  -5.847458 1.010162 -0.907803
H  7.070347 1.166873 -0.877356
H  7.065854 1.174155 0.897152
H  -7.107262 -1.162171 -0.910481
H  -7.111092 -1.151645 0.892638
H  8.42049 -0.983412 0.915817
H  9.274999 0.3043 0.017554
H  8.42351 -0.992997 -0.869743
H  -9.084573 -0.107434 -0.019524
