program: Gaussian 09
title: 000008204
version: EM64L-G09RevD.01
frameworkgroup: C1[X(C13H29N3)]
method: RPBEPBE
basis: SDD
operation: Freq
keyword: #pfreq=noraman
keyword: PBEPBE/SDD
title: #p freq=noraman PBEPBE/SDD
converged: YES YES NO NO
title: Mulliken charges:
elementType: N N N C C C C C C C C C C C C C H H H H H H H H H H H H H H H H H H H H H H H H H H H H H
charge: -0.109541 -0.657371 -0.635138 -0.384430 -0.384412 -0.386338 -0.381769 -0.374309 -0.372659 -0.369538 -0.353261 -0.391276 -0.356728 -0.457781 -0.697107 0.207688 0.193095 0.190846 0.192916 0.191498 0.189571 0.194608 0.190803 0.191817 0.182389 0.191947 0.188493 0.189273 0.226905 0.173568 0.187025 0.187628 0.206337 0.179611 0.194736 0.194313 0.178371 0.207735 0.209447 0.214253 0.209649 0.307307 0.333539 0.289839 0.316449
chargesum: 0.00000
title: Mulliken charges with hydrogens summed into heavy atoms:
elementType: N N N C C C C C C C C C C C C C
charge: -0.109541 -0.016526 -0.028850 -0.000489 0.000002 -0.002158 0.000851 0.000027 0.005108 0.030936 0.021392 -0.005328 0.032322 -0.071675 -0.063758 0.207688
polarizability: 2.15721835e+02 1.04184131e+01 1.55127465e+02 7.85727910e+00 -1.24895435e+00 1.32385503e+02
1716.lowfreq: -3.5999 -0.0017 -0.0013 0.0008 7.1100 14.2641 20.1237 24.1542 33.5445
frequency: 19.6486 21.2285 33.4425 39.3918 44.8533 68.2279 73.6412 92.7767 104.3345 114.7584 133.8382 148.9370 151.7246 154.5711 166.3030 199.1159 232.5712 234.1514 266.2675 281.8086 358.6827 369.2457 381.6892 403.0129 426.2432 447.7837 473.5769 477.3400 511.8940 556.9361 575.1340 676.0751 720.6884 722.4943 727.9460 739.8253 763.1679 797.5015 839.4365 864.3710 886.3446 888.5990 927.5030 960.4505 984.1773 987.5778 992.9594 1024.4910 1025.0718 1032.6571 1034.6791 1055.2747 1067.9174 1079.4157 1079.7793 1081.9150 1089.3010 1122.9598 1134.6800 1180.6400 1182.9575 1193.9365 1205.8216 1220.9193 1233.9907 1246.6076 1260.3912 1270.3671 1277.8292 1281.7271 1284.4904 1289.9587 1294.0908 1296.3647 1297.9873 1320.2005 1340.8191 1349.4655 1351.6262 1353.9498 1355.2473 1362.6093 1388.6759 1404.9956 1450.9921 1455.7864 1458.8253 1459.1961 1462.6160 1463.2319 1466.5801 1471.5759 1476.9540 1477.5714 1481.9742 1485.9290 1488.2357 1600.4517 1615.9130 1671.0516 2857.8242 2919.1871 2945.1979 2947.0714 2947.8389 2949.2729 2950.3996 2952.8834 2957.0228 2961.8927 2967.2253 2970.7780 2972.0090 2980.5281 2983.3472 2988.0752 2995.5533 3005.6950 3016.2699 3022.6101 3031.0886 3039.9796 3048.4110 3067.6802 3069.1313 3518.6292 3548.2050 3666.8317 3694.3482
redmass: 4.4020 3.5880 3.7324 1.7523 3.6356 2.2537 2.0447 3.4154 1.9000 2.3145 1.8940 2.1556 4.4330 1.9951 3.4015 2.8569 1.7768 1.5665 2.2323 3.0417 1.5945 3.0819 1.6487 1.3549 1.1890 2.0369 2.5082 3.1226 2.7587 2.0044 1.6984 4.7685 1.0586 1.0675 1.0876 1.1405 1.2236 1.3466 1.6384 1.8968 1.7004 1.6576 1.4970 2.0325 3.9733 1.4588 3.4558 1.6856 2.3696 1.7627 1.4394 2.8648 2.4854 2.2237 2.0726 2.2730 2.2854 2.7798 1.6685 2.0227 1.9305 1.2633 1.5291 1.3180 1.3766 1.2954 1.2986 1.2605 1.0165 1.2161 1.0452 1.1365 1.1372 1.1111 1.2263 1.3600 1.4517 1.4447 1.6480 1.6154 1.6611 1.5629 1.2182 4.3207 1.0837 1.0892 1.0754 1.0734 1.0671 1.0707 1.0796 1.0836 1.0838 1.0427 1.0889 1.0941 1.0935 1.2261 1.2707 3.6310 1.0608 1.0943 1.0590 1.0588 1.0593 1.0597 1.0607 1.0619 1.0605 1.0590 1.0585 1.0367 1.0628 1.0959 1.0967 1.0984 1.1005 1.1020 1.1003 1.1011 1.1047 1.1045 1.1032 1.1007 1.0993 1.0450 1.0454 1.1014 1.1024
irintensity: 1.5616 1.3268 2.5236 0.2041 0.1828 0.4091 0.3694 0.2658 0.0864 0.2067 0.0569 0.0903 2.6458 0.0213 0.3794 1.5060 4.0588 3.3132 2.4517 3.1972 54.4982 0.0276 48.8254 124.6238 182.4128 34.0581 10.3386 1.5637 2.7839 119.5500 114.4286 86.7963 17.8102 0.1920 5.6693 0.1882 0.5475 2.0864 0.8725 3.1499 3.2917 3.8890 2.7373 7.1673 0.7873 1.6695 4.2357 2.4278 0.1053 0.6938 9.7113 0.8378 1.3375 0.9151 0.8059 0.5142 5.5103 11.8968 2.5597 1.0673 1.4873 26.7729 2.6611 0.1000 1.2769 0.5167 1.9852 0.0405 0.3379 0.3363 1.4670 0.1507 0.5494 0.1489 0.2266 0.1565 0.6714 37.7833 0.7777 1.5013 3.1431 13.2874 11.3509 125.5914 8.7054 23.3708 0.0079 0.0664 0.2186 0.0675 0.2145 0.6969 1.1850 12.2049 1.7822 4.8958 35.8143 128.3681 82.1551 539.7003 79.8053 59.2567 2.5139 0.7090 0.5793 0.5105 1.4035 9.3929 4.7383 115.4384 172.4060 36.2962 105.7382 2.0147 2.7532 2.8884 2.3075 2.5586 10.2816 2.8772 0.8364 143.9438 197.7984 98.7702 56.8555 16.3783 15.4007 17.9538 18.3926
temp: 298.150 k
press: 1.00000 atm
elementType: 7 7 7 6 6 6 6 6 6 6 6 6 6 6 6 6 1 1 1 1 1 1 1 1 1 1 1 1 1 1 1 1 1 1 1 1 1 1 1 1 1 1 1 1 1
symmnumber: 1
zpe: 1071123.9 jmol-1
zpe.correction: 0.407970 hartree
zpe.thermalcorrener: 0.429446 hartree
zpe.thermalcorrenthalpy: 0.430390 hartree
zpe.thermalcorrgfe: 0.354115 hartree
zpe.sumelectzpe: -675.697836 hartree
zpe.sumelectthermal: -675.676359 hartree
zpe.sumelectthermalent: -675.675415 hartree
zpe.sumelectthermalfe: -675.751691 hartree
dipole: 2.9099 0.7877 1.4479
dipole: 3.3443
quadrupole: -73.1962 -98.4604 -100.6275
quadrupole: 7.9955 10.0207 -4.0778
quadrupole: 17.5651 -7.6990 -9.8661 7.9955 10.0207 -4.0778
hfenergy: -676.1058053 hartree
pointgroup: C01 [X(C13H29N3)]
dipole: 1.1452675 0.3039465 0.5719956 debye
polarizability: 215.7876414|10.1372854|155.0389675|8.0045613|-1.2347875|132.4081941 unknown
InChI: InChI=1S/C13H29N3/c1-2-3-4-5-6-7-8-9-10-11-12-16-13(14)15/h2-12,14-15H2,1H3
charge 0 multiplicity 1
45 atoms
N  5.259673 0.168878 -0.505544
N  7.184679 0.596841 0.921863
N  6.408501 2.220066 -0.586819
C  -1.498123 -0.777453 -0.243954
C  -2.65277 0.127324 0.242262
C  -0.104506 -0.298648 0.22178
C  -4.046956 -0.356769 -0.216493
C  1.049977 -1.205447 -0.261385
C  -5.201814 0.547208 0.271079
C  2.441159 -0.726361 0.209054
C  -6.596719 0.058066 -0.180053
C  3.591516 -1.638999 -0.264184
C  -7.751624 0.961773 0.309327
C  4.982073 -1.120716 0.160684
C  -9.141666 0.462439 -0.141362
C  6.238922 0.923593 -0.067464
H  -1.515271 -0.829543 -1.352963
H  -1.668249 -1.81357 0.117399
H  -2.485575 1.162319 -0.123207
H  -2.631771 0.183204 1.351099
H  -0.087928 -0.245252 1.33088
H  0.068537 0.736273 -0.140572
H  -4.213184 -1.391902 0.149165
H  -4.068367 -0.412744 -1.325217
H  0.874044 -2.242255 0.09682
H  1.037539 -1.254445 -1.370614
H  -5.176356 0.607501 1.379599
H  -5.038762 1.581197 -0.09923
H  2.635249 0.297769 -0.164765
H  2.452263 -0.667359 1.31892
H  -6.760642 -0.975775 0.190344
H  -6.624289 -0.001979 -1.288462
H  3.574238 -1.711028 -1.369458
H  3.447378 -2.664283 0.136345
H  -7.588903 1.993821 -0.063316
H  -7.720619 1.023316 1.41658
H  5.007697 -1.037784 1.276837
H  5.744863 -1.882442 -0.124283
H  -9.339619 -0.556173 0.242978
H  -9.949394 1.124058 0.222725
H  -9.209211 0.422093 -1.245113
H  7.638294 1.33374 1.457648
H  7.194107 -0.344478 1.303754
H  7.353722 2.576427 -0.725602
H  5.701884 2.492999 -1.268783
