program: Gaussian 09
title: 000084853
version: EM64L-G09RevD.01
frameworkgroup: C1[X(C9H8FNO)]
method: RPBEPBE
basis: SDD
operation: Freq
keyword: #p
keyword: freq=noraman
keyword: PBEPBE/SDD
title: #p freq=noraman PBEPBE/SDD
converged: NO NO NO NO
title: Mulliken charges:
elementType: F O N C C C C C C C C C H H H H H H H H
charge: -0.199425 -0.242795 -0.145151 -0.393063 -0.421617 0.089229 0.275989 -0.292349 -0.317458 -0.372386 -0.363238 0.331419 0.261545 0.245411 0.242916 0.247089 0.254652 0.279545 0.258700 0.260989
chargesum: 0.00000
title: Mulliken charges with hydrogens summed into heavy atoms:
elementType: F O N C C C C C C C C C
charge: -0.199425 -0.242795 -0.145151 0.113893 0.068388 0.089229 0.275989 -0.037698 -0.037913 -0.113687 -0.102249 0.331419
polarizability: 1.52396949e+02 -8.91844127e-01 1.09483990e+02 -4.75741105e+00 5.60406804e+00 5.39391336e+01
1716.lowfreq: -5.6868 0.0001 0.0006 0.0008 1.5880 14.4980 53.2291 77.0608 121.9928
frequency: 53.2162 77.0260 121.9887 130.9890 182.3849 248.1243 305.4751 325.8808 370.5203 413.9954 451.4132 499.0418 569.2332 620.7518 641.3134 676.6824 753.3661 789.0997 803.4592 823.7874 849.7898 862.6708 917.4738 961.3668 981.7321 1002.4918 1004.4429 1036.4869 1098.9682 1102.8218 1112.8732 1120.8910 1141.8528 1155.1382 1195.9059 1225.3554 1289.3394 1371.2200 1380.1281 1407.6369 1464.3368 1481.1083 1490.7765 1557.0015 1601.2809 1608.6643 3071.7444 3083.7227 3158.8538 3159.7809 3174.3567 3178.3174 3181.5157 3192.6374
redmass: 4.2970 3.8595 6.5349 3.5691 4.3123 4.6255 7.0383 6.8817 7.2433 2.9652 5.3031 3.0626 6.9641 7.0691 6.4925 4.3138 4.1516 6.2089 1.0463 1.2660 2.0551 3.1335 5.1928 1.3749 1.3570 1.4124 1.9748 2.7120 1.2680 1.2960 1.3451 1.5580 1.4364 1.3817 2.1722 4.8409 1.2614 4.8654 6.9332 4.0946 1.0755 1.2420 2.6214 10.5831 8.1619 6.4055 1.0501 1.0581 1.0891 1.0884 1.1188 1.0968 1.0977 1.1176
irintensity: 1.6151 2.0512 5.3775 0.7182 8.9170 11.9262 1.8495 0.7341 3.9717 0.0646 2.6222 15.0506 26.2144 3.5329 2.6659 16.1548 18.5617 10.9171 17.2699 4.2441 38.9357 41.4742 2.3030 1.1519 1.3528 14.1513 12.2329 60.5076 1.0533 19.5522 10.6474 16.4818 3.8260 67.3570 11.2704 97.5213 4.6759 383.8956 35.8474 20.1855 4.4457 21.6197 41.7908 150.7378 56.4267 86.0800 20.3262 29.4851 0.1059 3.6723 4.2056 3.3525 3.3423 20.8669
temp: 298.150 k
press: 1.00000 atm
elementType: 9 8 7 6 6 6 6 6 6 6 6 6 1 1 1 1 1 1 1 1
symmnumber: 1
zpe: 391660.0 jmol-1
zpe.correction: 0.149175 hartree
zpe.thermalcorrener: 0.159496 hartree
zpe.thermalcorrenthalpy: 0.160441 hartree
zpe.thermalcorrgfe: 0.112510 hartree
zpe.sumelectzpe: -576.672351 hartree
zpe.sumelectthermal: -576.662030 hartree
zpe.sumelectthermalent: -576.661086 hartree
zpe.sumelectthermalfe: -576.709016 hartree
dipole: 1.5551 -3.0111 1.4800
dipole: 3.6980
quadrupole: -69.4213 -67.0624 -70.0840
quadrupole: -10.3922 3.1764 2.7884
quadrupole: -0.5654 1.7935 -1.2281 -10.3922 3.1764 2.7884
hfenergy: -576.8215262 hartree
pointgroup: C01 [X(C9H8F1N1O1)]
dipole: 0.7249043 -0.9210955 0.8618835 debye
dipolederiv: -1.1827135 -0.1450463 0.2342351 -0.1769677 -0.2349213 0.0444901 0.2621266 0.0441197 -0.2111246 -0.7428686 -0.166594 0.0958327 0.0637902 -0.8926978 0.2913283 -0.0111935 0.2518497 -0.4533491 -1.1811636 0.4654081 -0.359992 0.8568379 -0.824535 0.1170495 -0.212123 -0.087678 -0.3022698 0.2480471 -0.0572006 0.0092802 -0.1069557 0.1603722 0.109251 0.0400454 0.1066418 0.1561555 0.170371 -0.1035146 0.1515142 -0.2171791 0.3382616 0.0133151 0.1941191 0.0307824 0.1823396 1.8574306 -0.1817707 -0.080967 -0.5438816 1.2234208 -0.4401972 -0.1223672 -0.2704341 0.294333 -0.5784409 -0.0464406 0.0938259 -0.0593898 -0.1392817 0.0643264 0.0857516 0.0424411 -0.049362 0.1342013 0.0109686 -0.0698212 0.1016352 0.061864 -0.0294972 -0.1197779 -0.0194872 -0.0808654 0.1640747 0.0325109 -0.0685239 -0.0936811 0.0713146 -0.0064785 -0.0201035 -0.0394619 -0.0909821 -0.3752388 0.0096844 0.0377659 0.2176898 -0.006176 -0.0589588 0.0333806 -0.0166974 -0.1682666 -0.2302144 -0.1047489 0.0129585 -0.3006558 -0.1015006 0.0568173 0.0514856 0.0173997 -0.1720278 1.2843905 0.1493462 -0.2789945 0.1652094 0.3556051 -0.0561197 -0.2986205 -0.0611734 0.1792468 0.0017715 0.0044294 0.0102995 -0.0891667 -0.0272354 -0.0746969 -0.047223 -0.0264456 0.0910183 -0.0632818 0.0410421 0.0662037 0.0228889 0.0597227 -0.05895 0.1149601 -0.0624625 0.0483298 0.1293405 -0.0314811 0.0087786 0.0506168 -0.1198462 0.0482176 -0.0230914 0.0168059 0.0390051 0.0847221 0.058289 0.0454357 0.0203769 0.0246311 -0.059865 -0.0111567 0.0116554 -0.0918837 0.0614019 0.0929992 0.0203279 0.0924613 0.0170845 -0.0005947 0.0244897 0.0040819 0.1331971 0.1281394 -0.054639 0.0167065 -0.0202765 0.0189736 0.0131577 -0.0049023 0.0326495 0.1500337 0.0701105 -0.0409019 0.0273367 -0.0580535 -0.0175014 0.0294702 0.0351584 0.0269909 0.1709388 0.0199207 0.0676597 0.0277976 0.0747011 0.0324452 -0.0020654 0.0290418 -0.001578 0.1755334 unknown
polarizability: 150.076715|-3.7153217|106.8540197|-15.3727933|-12.6819424|58.8893382 unknown
InChI: InChI=1S/C9H8FNO/c10-8-3-1-7(2-4-8)9(12)11-5-6-11/h1-4H,5-6H2
charge 0 multiplicity 1
20 atoms
F  -3.993022 -0.453009 0.707096
O  1.776025 1.722288 -1.170032
N  2.355978 -0.459338 -0.567385
C  3.790633 -0.285868 -0.268286
C  2.885612 -1.101978 0.668553
C  1.431159 0.596279 -0.695442
C  0.015593 0.276444 -0.319255
C  -0.430444 -1.050668 -0.08018
C  -0.904998 1.353477 -0.220894
C  -1.774325 -1.303336 0.26374
C  -2.250227 1.120364 0.125397
C  -2.650799 -0.207552 0.362652
H  4.111527 0.712097 0.053415
H  4.486542 -0.806487 -0.933769
H  2.945394 -2.19581 0.660108
H  2.615429 -0.654398 1.633154
H  0.268737 -1.884743 -0.190501
H  -0.542121 2.36495 -0.428745
H  -2.144195 -2.316753 0.443434
H  -2.975497 1.934641 0.208939
