program: Gaussian 09
title: 000084803
version: EM64L-G09RevD.01
frameworkgroup: C1[X(C7H5Cl3)]
method: RPBEPBE
basis: SDD
operation: Freq
keyword: #pfreq=noraman
keyword: PBEPBE/SDD
title: #p freq=noraman PBEPBE/SDD
converged: NO YES NO NO
title: Mulliken charges:
elementType: Cl Cl Cl C C C C C C C H H H H H
charge: 0.016957 0.016954 -0.045864 0.624902 -0.274172 -0.423271 -0.797030 -0.078613 -0.188175 -0.220352 0.289175 0.240911 0.334009 0.241196 0.263372
chargesum: 0.00000
title: Mulliken charges with hydrogens summed into heavy atoms:
elementType: Cl Cl Cl C C C C C C C
charge: 0.016957 0.016954 -0.045864 0.624902 0.015003 -0.182361 -0.463021 -0.078613 0.053022 0.043020
polarizability: 1.28754964e+02 3.83222620e-01 1.06553545e+02 2.61975650e-03 6.45426321e-04 6.78380214e+01
1716.lowfreq: -9.4840 -6.7487 -0.0020 -0.0016 -0.0006 6.6496 20.6520 87.4271 112.7289
frequency: 19.8827 87.4271 112.7289 183.1185 215.4256 268.5388 289.0038 347.0897 387.3947 435.5307 535.2481 570.5968 647.8973 653.2660 701.4592 702.3836 796.1269 874.9392 889.3677 911.5470 979.2664 984.0809 1073.7869 1091.0626 1180.5912 1190.4409 1193.1972 1233.6253 1300.0104 1383.2020 1424.7239 1460.9965 1579.8095 1601.0892 3135.5990 3138.7881 3156.6354 3169.4987 3177.4598
redmass: 10.0761 9.7844 18.6923 5.3739 14.3700 5.4512 7.6332 7.8371 12.2119 3.0844 6.8941 6.9177 5.2277 6.7577 2.1969 6.8881 1.4829 5.7469 1.4991 1.4043 1.3438 6.0155 2.1472 1.5899 1.0985 1.0709 1.4219 1.9289 1.3634 8.7375 2.5711 2.4400 6.4932 6.6849 1.0890 1.0888 1.0928 1.0933 1.0985
irintensity: 0.0131 0.0305 1.0970 0.0427 3.9128 0.2627 2.5505 1.8676 8.0626 3.3093 37.1661 29.1087 56.5958 14.2300 133.9595 57.3060 17.1716 28.6939 6.6732 0.0367 0.2327 2.8536 24.2260 0.1034 1.1423 13.7642 27.5561 72.5289 10.8365 1.7329 36.8716 12.2762 32.5371 5.8380 1.5140 5.0527 9.1643 0.3324 6.5489
temp: 298.150 k
press: 1.00000 atm
elementType: 17 17 17 6 6 6 6 6 6 6 1 1 1 1 1
symmnumber: 1
zpe: 257692.6 jmol-1
zpe.correction: 0.098150 hartree
zpe.thermalcorrener: 0.107687 hartree
zpe.thermalcorrenthalpy: 0.108632 hartree
zpe.thermalcorrgfe: 0.060650 hartree
zpe.sumelectzpe: -1649.202058 hartree
zpe.sumelectthermal: -1649.192521 hartree
zpe.sumelectthermalent: -1649.191577 hartree
zpe.sumelectthermalfe: -1649.239558 hartree
dipole: 0.8190 3.4109 -0.0007
dipole: 3.5078
quadrupole: -80.6507 -70.8370 -83.7198
quadrupole: 1.0716 0.0015 -0.0021
quadrupole: -2.2482 7.5655 -5.3173 1.0716 0.0015 -0.0021
hfenergy: -1649.3002083 hartree
pointgroup: C01 [X(C7H5Cl3)]
dipole: -0.4356905 -1.3094973 -0.0002651 debye
dipolederiv: -0.4204498 -0.0833311 -0.1828393 -0.2172267 -0.1951898 -0.2276891 -0.2665953 -0.1172301 -0.6045497 -0.4203297 -0.0834436 0.1827636 -0.217363 -0.1954312 0.2280178 0.2663323 0.1175105 -0.6043161 -0.4000628 0.3057594 0.0000579 0.3802325 -0.5330148 -0.0000762 0.0000805 -0.0000809 -0.064009 -0.2165536 0.0015153 0.0000066 -0.1286164 0.0457187 0.000066 0.0001099 0.0000667 -0.1514115 -0.1965609 0.2074402 0.0000301 0.1293284 -0.1784148 -0.0000198 -0.000001 -0.0000537 -0.0596324 -0.0930382 -0.1280808 -0.0000214 0.0427955 0.0010848 0.0000198 -0.0000149 0.0000245 -0.1571094 1.112938 0.2431506 0.0000838 0.4415912 0.3879197 -0.0003646 0.0001831 -0.0003347 1.3307548 0.5351346 -0.5735571 -0.0001107 -0.6614965 0.7860285 0.0001237 -0.000119 0.0001366 -0.04441 0.0313871 0.0498873 -0.0000126 0.085115 0.0987043 0.000018 -0.0000173 0.0000131 -0.1073034 -0.0659678 0.1006869 -0.0000114 0.1458895 -0.2288377 -0.0000199 0.0000028 -0.0000173 -0.107445 0.1015322 -0.0351385 0.000001 -0.0426956 0.0362931 -0.0000124 -0.0000022 0.0000027 0.1439102 0.0131834 0.1083357 0.0000302 0.0837573 -0.0026732 -0.0000278 0.0000244 -0.0000188 0.1494623 0.0145731 -0.0381814 -0.0000073 0.0246771 -0.0564838 -0.0000093 -0.0000155 0.0000062 -0.0491856 0.0388562 -0.0607327 0.0000076 -0.0648341 -0.0698856 -0.0000209 0.0000142 -0.0000226 0.1616133 -0.0346418 -0.0143105 0.0000221 -0.0011541 0.1041819 -0.0000054 0.000018 -0.0000022 0.1636315 unknown
polarizability: 128.6581304|-1.5123924|106.6503786|-0.0026653|-0.0004192|67.8380214 unknown
InChI: InChI=1S/C7H5Cl3/c8-6-3-1-2-5(4-6)7(9)10/h1-4,7H
charge 0 multiplicity 1
15 atoms
Cl 2.724295 0.654554 1.530135
Cl 2.724164 0.655737 -1.529959
Cl -2.69187 2.083678 0.000356
C  0.599483 -0.368879 -0.000213
C  -0.227516 0.782928 0.000003
C  0.01964 -1.661609 -0.000322
C  2.095839 -0.247783 -0.000231
C  -1.619878 0.610768 0.000104
C  -1.386865 -1.804485 -0.000165
C  -2.221797 -0.666337 0.000065
H  0.216295 1.78255 0.00007
H  0.65976 -2.551003 -0.000493
H  2.612074 -1.214804 -0.000617
H  -1.837071 -2.802422 -0.000223
H  -3.311153 -0.765094 0.000191
