program: Gaussian 09
title: 000008195
version: EM64L-G09RevD.01
frameworkgroup: C1[X(C12H26S)]
method: RPBEPBE
basis: SDD
operation: Freq
keyword: #pfreq=noraman
keyword: PBEPBE/SDD
title: #p freq=noraman PBEPBE/SDD
converged: YES YES NO NO
title: Mulliken charges:
elementType: S C C C C C C C C C C C C H H H H H H H H H H H H H H H H H H H H H H H H H H
charge: -0.044501 -0.385537 -0.384492 -0.383368 -0.382084 -0.380491 -0.372848 -0.366608 -0.353370 -0.313812 -0.356806 -0.718876 -0.696511 0.194180 0.194135 0.193028 0.192975 0.193065 0.193147 0.192242 0.192197 0.194947 0.194979 0.189352 0.189296 0.192374 0.192288 0.187726 0.187768 0.216946 0.216982 0.194729 0.194704 0.256324 0.256283 0.209669 0.214961 0.209686 0.095322
chargesum: 0.00000
title: Mulliken charges with hydrogens summed into heavy atoms:
elementType: S C C C C C C C C C C C C
charge: 0.050821 0.002778 0.001510 0.002844 0.002355 0.009434 0.005800 0.018055 0.022124 0.120116 0.032627 -0.206270 -0.062194
polarizability: 2.06194079e+02 -1.59209627e+00 1.28039026e+02 -2.37885100e-02 -4.59607743e-02 1.12381066e+02
1716.lowfreq: -3.5716 -0.0022 -0.0017 -0.0003 7.9101 20.3514 25.6177 27.1480 49.9519
frequency: 23.0748 25.7641 42.2304 50.8945 72.3475 77.2415 88.1939 106.7592 122.6139 132.6269 132.8657 144.7077 157.6366 159.6716 161.4936 215.9395 225.7218 286.5750 314.6087 393.3878 415.1119 482.6762 491.2537 692.8301 722.7196 724.6662 730.4320 742.7714 761.6630 790.1599 813.7455 832.4217 882.4658 887.1441 934.8309 980.6591 984.5796 989.6872 1017.3113 1026.4832 1035.2752 1053.4587 1067.5226 1071.5327 1076.9991 1080.9034 1081.8560 1091.7783 1123.6958 1181.9982 1201.2910 1203.4722 1226.8043 1230.1961 1252.3169 1252.3877 1274.1709 1274.8238 1280.4560 1286.6869 1291.6993 1295.4967 1299.3801 1301.1703 1302.3929 1322.8732 1341.5353 1352.3952 1354.1613 1357.2923 1357.6648 1389.0229 1454.6349 1461.3239 1461.4529 1464.3964 1465.1504 1467.2657 1470.4742 1475.2075 1476.3581 1480.1742 1484.9475 1488.7971 1490.7197 2426.5731 2950.2541 2950.4845 2952.1431 2953.1092 2955.5398 2957.6910 2962.2905 2966.7698 2969.4681 2972.1416 2982.7547 2983.3304 2986.5357 2991.2447 2997.2741 3004.6974 3014.9041 3018.4592 3025.1992 3034.3664 3042.0064 3048.0819 3068.7233 3070.7486 3094.4018
redmass: 3.5250 4.7089 2.1410 2.4167 4.1419 1.6817 2.3001 1.5371 1.8371 1.7752 4.3047 1.7919 2.0646 4.6214 1.9801 3.5442 1.1343 4.4224 3.2411 3.3958 3.2347 3.0283 3.0560 4.5484 1.0588 1.0679 1.0816 1.0989 1.1245 1.1735 1.2341 1.2161 1.2338 1.9041 1.2231 5.0687 1.1788 4.4913 3.9644 1.0970 3.3639 3.2091 1.0717 2.6996 2.5304 2.1194 2.1813 2.6925 2.9958 1.9100 1.6250 1.2508 1.4424 1.2759 1.3197 1.2758 1.2346 1.2791 1.0218 1.0574 1.1502 1.0690 1.3084 1.1185 1.1038 1.3602 1.4321 1.5285 1.6991 1.6343 1.6195 1.2174 1.0884 1.0725 1.0725 1.0671 1.0705 1.0688 1.0816 1.0822 1.0423 1.0861 1.0920 1.0957 1.0984 1.0385 1.0585 1.0585 1.0589 1.0592 1.0590 1.0593 1.0591 1.0587 1.0585 1.0366 1.0590 1.0960 1.0971 1.0986 1.1004 1.1024 1.1040 1.0558 1.1046 1.1048 1.1046 1.1046 1.1007 1.0993 1.1095
irintensity: 0.4417 0.1684 6.9112 2.4253 0.5138 2.4624 2.3347 4.5712 6.4163 2.8740 0.8730 3.1010 0.1037 0.0291 0.4738 1.4070 0.0003 1.5517 0.2998 1.1319 0.1182 0.5823 0.1908 6.5093 16.9668 0.2440 8.3165 1.0684 5.7085 0.1769 1.4812 1.8412 0.0127 4.7198 0.9690 0.0901 0.0041 1.6083 0.3539 0.4302 0.0518 0.0179 0.6149 0.8053 0.6523 0.1839 0.1517 6.2248 10.3686 0.1797 0.0107 19.6480 0.2257 2.4807 1.2373 6.7120 0.0464 8.2766 0.0946 0.5171 0.1109 0.0196 7.1284 0.0047 0.1787 4.4245 5.1056 1.4265 0.4527 0.0386 1.1853 11.3038 2.2282 0.0315 0.0607 0.0177 0.1229 0.4991 0.5725 0.8762 12.3280 1.2060 1.9369 0.7613 42.2097 45.6069 0.0124 0.0373 0.0058 0.9451 0.4425 2.7965 3.8379 73.3719 231.1300 36.7317 39.6223 0.0294 0.0744 0.1547 0.3151 0.4447 0.0201 39.8801 4.1350 1.2412 101.9074 208.9206 100.0544 55.4839 47.0966
temp: 298.150 k
press: 1.00000 atm
elementType: 16 6 6 6 6 6 6 6 6 6 6 6 6 1 1 1 1 1 1 1 1 1 1 1 1 1 1 1 1 1 1 1 1 1 1 1 1 1 1
symmnumber: 1
zpe: 925136.7 jmol-1
zpe.correction: 0.352366 hartree
zpe.thermalcorrener: 0.371037 hartree
zpe.thermalcorrenthalpy: 0.371981 hartree
zpe.thermalcorrgfe: 0.302449 hartree
zpe.sumelectzpe: -869.822325 hartree
zpe.sumelectthermal: -869.803655 hartree
zpe.sumelectthermalent: -869.802710 hartree
zpe.sumelectthermalfe: -869.872242 hartree
dipole: -1.1277 1.6673 -0.0078
dipole: 2.0129
quadrupole: -105.2985 -93.9947 -92.5482
quadrupole: 12.0634 -0.0698 -0.0124
quadrupole: -8.0180 3.2858 4.7322 12.0634 -0.0698 -0.0124
hfenergy: -870.1746911 hartree
pointgroup: C01 [X(C12H26S1)]
dipole: 0.4387964 0.6592293 0.0071044 debye
polarizability: 206.166054|2.1735958|128.0658663|-0.0225134|0.1432947|112.3822511 unknown
InChI: InChI=1S/C12H26S/c1-2-3-4-5-6-7-8-9-10-11-12-13/h13H,2-12H2,1H3
charge 0 multiplicity 1
39 atoms
S  -7.946188 -0.594699 -0.003916
C  0.008507 -0.37194 -0.00508
C  1.306519 0.466724 -0.000834
C  -1.275445 0.488025 -0.00014
C  2.591114 -0.392282 -0.005095
C  -2.573218 -0.350927 -0.004507
C  3.889157 0.446545 -0.000345
C  -3.855717 0.512133 0.002557
C  5.174083 -0.411997 -0.004216
C  -5.149557 -0.33684 -0.003453
C  6.472259 0.427497 0.001561
C  -6.413658 0.53795 0.005717
C  7.750424 -0.43887 -0.002319
H  0.003058 -1.033714 -0.896481
H  0.003339 -1.043095 0.879268
H  1.311914 1.137796 -0.885366
H  1.311921 1.128768 0.890475
H  -1.269323 1.14941 0.891598
H  -1.269702 1.159251 -0.884489
H  2.586283 -1.054276 -0.896408
H  2.585828 -1.06354 0.879247
H  -2.5787 -1.022526 0.879124
H  -2.580338 -1.010791 -0.89693
H  3.894624 1.117751 -0.88485
H  3.894017 1.108689 0.890969
H  -3.84942 1.183651 -0.881222
H  -3.848683 1.169972 0.896572
H  5.169971 -1.083705 0.879887
H  5.171337 -1.073765 -0.895794
H  -5.159266 -0.989094 -0.89919
H  -5.157343 -1.004776 0.880669
H  6.475375 1.098352 -0.88191
H  6.473905 1.088314 0.892579
H  -6.452621 1.18264 -0.888794
H  -6.451298 1.165542 0.91237
H  7.784673 -1.097296 0.886324
H  8.664049 0.183825 0.002838
H  7.787025 -1.085939 -0.899171
H  -8.894504 0.416535 0.010259
