program: Gaussian 09
title: 000084733
version: EM64L-G09RevD.01
frameworkgroup: C1[X(C6H14O2S2)]
method: RPBEPBE
basis: SDD
operation: Freq
keyword: #p
keyword: freq=noraman
keyword: PBEPBE/SDD
title: #p freq=noraman PBEPBE/SDD
converged: NO YES NO NO
title: Mulliken charges:
elementType: S S O O C C C C C C H H H H H H H H H H H H H H
charge: 0.000667 -0.065404 -0.259731 -0.276172 -0.248722 -0.246792 -0.168127 -0.198520 -0.711299 -0.689445 0.185195 0.204116 0.182335 0.209775 0.196476 0.191799 0.207245 0.195769 0.282337 0.249255 0.266064 0.246413 0.089118 0.157646
chargesum: 0.00000
title: Mulliken charges with hydrogens summed into heavy atoms:
elementType: S S O O C C C C C C
charge: 0.089786 0.092242 -0.259731 -0.276172 0.140589 0.145319 0.220149 0.204494 -0.179707 -0.176967
polarizability: 1.18147577e+02 -2.35967113e+00 1.14464395e+02 7.96194250e-01 -8.15485342e-02 8.02621766e+01
1716.lowfreq: -7.4570 -0.0030 -0.0029 -0.0027 6.5646 8.3788 27.5518 34.4009 43.7412
frequency: 26.1311 34.3087 43.6586 49.1443 115.9880 136.4564 151.3541 170.3306 191.5500 216.9242 275.2898 299.7450 322.4523 369.3480 450.0001 464.8329 513.1453 613.6895 623.9859 730.5921 741.6717 808.4457 827.6197 906.8545 931.7652 965.6504 974.3480 1014.9675 1025.2136 1042.8208 1062.8758 1092.6906 1102.3460 1114.8920 1175.7838 1188.8175 1205.0614 1225.8622 1226.3988 1250.0632 1292.4225 1301.3625 1332.3355 1340.7451 1389.1822 1407.4949 1426.7397 1433.7256 1453.3675 1457.3103 1472.9082 1476.3798 2405.4795 2427.0049 2896.4670 2921.8740 2926.2520 2940.6975 2954.4846 2985.6423 2990.6350 2999.2612 3037.9607 3039.3540 3109.7742 3114.3219
redmass: 8.0353 5.4430 7.7288 3.3333 3.7349 3.2400 1.4676 4.3213 2.1771 1.9426 2.5906 2.3397 2.5605 1.0805 2.8656 2.4472 3.0129 4.5618 4.5914 1.3151 1.5287 1.9483 1.5527 1.7399 1.9469 1.9677 1.7905 2.1432 2.3129 2.2524 2.2004 3.6566 3.3048 2.1767 1.0928 1.1074 1.1350 1.2179 1.2281 1.1487 1.2175 1.2078 1.2147 1.2767 1.3572 1.5308 1.0886 1.0927 1.0839 1.0845 1.0835 1.0814 1.0379 1.0384 1.0587 1.0575 1.0575 1.0586 1.1000 1.1044 1.1011 1.1030 1.0597 1.0597 1.1062 1.1054
irintensity: 2.1740 0.2561 0.7539 2.5075 1.1481 6.2980 32.4671 6.4956 3.1600 9.2262 0.4323 1.5873 2.5420 30.0631 4.5600 7.4263 1.8639 5.9851 5.6863 16.2179 3.6979 8.5297 3.7090 8.8036 11.6855 15.7159 6.6068 53.0219 4.2169 22.0834 67.3704 104.9365 51.4282 20.7512 0.5417 4.6061 8.8245 0.7345 3.5303 4.1453 11.2302 7.0123 25.3839 26.1998 1.0624 0.5433 13.6950 11.3252 8.8122 10.1041 8.9205 6.4752 9.8193 30.0858 74.8549 26.5886 61.8606 153.9150 51.4223 46.0940 41.1007 57.8583 44.6042 29.1897 16.0485 9.7763
temp: 298.150 k
press: 1.00000 atm
elementType: 16 16 8 8 6 6 6 6 6 6 1 1 1 1 1 1 1 1 1 1 1 1 1 1
symmnumber: 1
zpe: 503725.1 jmol-1
zpe.correction: 0.191859 hartree
zpe.thermalcorrener: 0.205415 hartree
zpe.thermalcorrenthalpy: 0.206359 hartree
zpe.thermalcorrgfe: 0.148964 hartree
zpe.sumelectzpe: -1182.703664 hartree
zpe.sumelectthermal: -1182.690107 hartree
zpe.sumelectthermalent: -1182.689163 hartree
zpe.sumelectthermalfe: -1182.746559 hartree
dipole: -1.0914 4.8349 1.2354
dipole: 5.1082
quadrupole: -62.3424 -79.3209 -76.1749
quadrupole: 0.3293 -3.9280 -3.2133
quadrupole: 10.2704 -6.7082 -3.5622 0.3293 -3.9280 -3.2133
hfenergy: -1182.8955225 hartree
pointgroup: C01 [X(C6H14O2S2)]
dipole: 0.6222719 -1.8498354 0.479381 debye
dipolederiv: -0.2298973 -0.0481974 0.0879241 -0.0972014 -0.2523505 -0.031911 0.1774411 -0.0902191 0.1059355 -0.1865065 -0.1530944 0.0564818 -0.0824933 -0.1728958 -0.1200505 0.0474733 -0.1352712 -0.2179031 -0.9119387 -0.3711191 -0.0374217 -0.3413485 -0.6827971 -0.0579785 -0.0412627 -0.023442 -0.3940333 -0.8826108 0.3516412 0.0430307 0.382481 -0.6982846 0.0152084 0.0029265 -0.0329585 -0.4011746 0.4021236 0.2024477 -0.0727492 0.2422954 0.6554596 0.025074 -0.1919554 -0.0805939 0.3191928 0.4287056 -0.2061383 -0.1080185 -0.2510851 0.6142116 0.0277506 -0.237314 0.1370583 0.3310002 0.7212496 0.2665411 0.0856794 0.0802133 0.2437105 0.0900259 0.2038558 0.1647727 0.353666 0.6615311 -0.2468134 0.0221497 -0.1270366 0.3222101 -0.0929101 0.1759186 -0.0900413 0.2897994 0.1083962 -0.1648916 -0.0096346 -0.1794247 0.3110087 0.0262565 -0.1103471 0.1399946 0.0706014 0.1481251 0.2377325 -0.0763227 0.1385091 0.1155182 -0.0482639 -0.044871 -0.0527812 0.120888 -0.0699921 0.1278728 0.0339375 0.0162675 -0.2268226 -0.0372323 0.0691859 -0.0603131 0.0467734 0.0477302 -0.0281621 -0.0127712 -0.0755573 0.0118843 -0.0413297 0.0333552 0.0649438 -0.1739672 -0.0551888 -0.1142015 0.0125606 -0.0101646 -0.2566074 -0.0149939 0.0605424 0.0082727 0.0565108 0.0378488 0.0314146 -0.0101392 0.0683965 0.0214105 0.0727976 0.0494704 -0.028128 -0.1623485 -0.0198633 -0.054698 0.0510092 -0.0197569 0.0482282 -0.0210744 -0.0583002 -0.0346865 -0.2017751 -0.1677586 0.0266302 -0.0099052 0.1852882 -0.1766009 -0.0212948 0.0036317 -0.0390988 0.0548689 -0.0026599 0.0460981 0.057749 0.0266609 0.0653721 -0.0027158 -0.0601896 -0.0031967 -0.1762914 -0.1737683 -0.0444975 0.0190708 -0.1829903 -0.1580534 0.032366 0.026905 0.0501727 0.0609504 0.1171433 0.0505309 0.0001398 0.0329283 0.0438287 -0.0221819 0.0386766 0.0015368 -0.0661268 -0.1605987 0.0178805 -0.0300032 0.0342174 -0.0226549 -0.015927 -0.0724477 -0.0208443 0.076516 0.0589268 -0.0683821 0.0174518 -0.0608279 0.0014738 0.0638802 0.0670817 0.0242173 -0.1326772 -0.1199991 0.0399379 -0.0359026 0.0338403 0.0375542 0.0226856 -0.0548999 0.025454 0.0908472 0.0722984 0.0745831 -0.0837472 0.097889 0.0667731 0.0744621 -0.0502833 -0.0248177 -0.1608189 0.1767033 0.0268847 -0.000569 0.0888998 0.0884235 0.0773569 -0.0345931 0.0999693 0.1095663 unknown
polarizability: 118.6152453|-1.917406|114.0084448|-0.3800451|0.2260128|80.2504585 unknown
InChI: InChI=1S/C6H14O2S2/c9-5-3-7-1-2-8-4-6-10/h9-10H,1-6H2
charge 0 multiplicity 1
24 atoms
S  2.129776 2.357238 0.135957
S  -1.911704 2.153915 -0.244103
O  1.366405 -0.787112 -0.356657
O  -1.475899 -0.941971 0.416801
C  0.686282 -1.965848 0.188563
C  -0.74204 -1.957549 -0.338192
C  2.6232 -0.483965 0.319631
C  -2.765515 -0.557513 -0.169537
C  3.172915 0.822635 -0.249863
C  -3.102964 0.824801 0.384936
H  1.210406 -2.895008 -0.129041
H  0.666238 -1.93002 1.299241
H  -1.206129 -2.959783 -0.201732
H  -0.735016 -1.711573 -1.421421
H  2.466595 -0.40626 1.419302
H  3.366012 -1.297002 0.136815
H  -2.694736 -0.518953 -1.277425
H  -3.54722 -1.296815 0.116716
H  3.189465 0.775633 -1.350773
H  4.198894 0.999046 0.114152
H  -3.078455 0.809585 1.487052
H  -4.102905 1.146088 0.049012
H  2.38329 2.367648 1.499692
H  -0.749894 1.460184 0.068476
