program: Gaussian 09
title: 000084728
version: EM64L-G09RevD.01
frameworkgroup: C1[X(C16H13NO2)]
method: RPBEPBE
basis: SDD
operation: Freq
keyword: #p
keyword: freq=noraman
keyword: PBEPBE/SDD
title: #p freq=noraman PBEPBE/SDD
converged: YES YES NO NO
title: Mulliken charges:
elementType: O O N C C C C C C C C C C C C C C C C H H H H H H H H H H H H H
charge: -0.205811 -0.240509 -0.233534 0.199951 0.183553 0.222154 0.069108 0.297633 -0.395811 -0.365030 -0.244728 -0.211005 -0.422690 -0.359992 -0.228574 -0.231170 -0.238793 -0.235822 -0.508050 0.288920 0.252044 0.227313 0.225963 0.268593 0.266771 0.188248 0.233997 0.232624 0.234900 0.248665 0.241157 0.239925
chargesum: 0.00000
title: Mulliken charges with hydrogens summed into heavy atoms:
elementType: O O N C C C C C C C C C C C C C C C C
charge: -0.205811 -0.240509 -0.233534 0.199951 0.183553 0.222154 0.069108 0.297633 -0.106891 -0.112986 -0.017415 0.014957 -0.154097 -0.093221 -0.040326 0.002827 -0.006169 -0.000922 0.221697
polarizability: 3.07975667e+02 -1.65388846e+00 1.99254048e+02 -5.16811650e-01 1.52529753e+01 9.79758950e+01
1716.lowfreq: -5.3601 -0.0004 -0.0004 -0.0003 4.9075 8.2648 49.4301 64.2359 68.4032
frequency: 49.4183 64.2066 68.3990 77.4060 95.3631 123.4686 152.3627 160.4289 177.3821 229.1370 254.5877 261.7111 281.1340 295.7971 377.8303 383.0694 407.0058 428.2976 443.9417 490.9328 531.4047 551.6055 578.2927 609.0542 613.5184 670.6155 676.1436 701.0275 733.8007 755.4314 761.5729 767.5020 807.6802 850.7901 856.4702 871.6547 889.2287 930.6511 953.3396 964.1897 981.4122 987.6560 991.0344 999.9997 1003.6619 1008.8061 1027.5462 1085.8803 1086.5264 1102.6807 1121.5777 1150.0505 1165.9726 1175.6856 1195.9008 1207.5257 1233.8093 1294.7076 1317.4085 1331.8580 1370.9254 1378.4575 1397.0223 1410.2025 1414.7150 1434.7433 1442.6231 1445.6752 1467.0296 1471.5049 1477.1987 1525.0544 1576.2919 1581.0047 1590.8398 1611.9167 1624.5646 2898.3393 2988.2184 3097.3310 3130.0595 3133.4726 3135.2959 3139.0946 3150.3509 3152.0202 3163.0515 3166.8778 3173.4290 3181.9155
redmass: 5.2021 3.6883 4.6997 3.2668 4.4930 4.8144 5.6245 1.2212 3.5332 4.6612 4.1796 4.9019 3.8405 5.7619 3.9267 7.6668 2.8769 5.2378 3.3856 4.1291 5.1576 5.8353 4.0104 6.7080 6.4115 5.2664 6.3972 1.9751 4.3106 3.0528 1.5689 2.1485 4.2660 4.9295 1.3280 1.3769 7.8728 1.4344 1.3616 1.6964 1.4326 5.3568 1.3087 1.3289 5.5338 2.3459 2.3674 1.6470 2.9857 1.2551 1.5715 1.4562 1.1638 1.0548 1.1394 4.1538 2.2454 3.0935 1.6337 1.9292 2.8596 1.8373 3.1904 4.2338 1.2762 2.5626 3.1041 1.0692 1.0681 3.0333 3.0467 6.4069 6.1100 6.0278 6.5076 6.0556 7.9939 1.0841 1.0282 1.1068 1.0851 1.0861 1.1040 1.0886 1.0910 1.0936 1.0968 1.0973 1.1000 1.0972
irintensity: 0.9196 1.0689 0.7148 3.4333 2.1689 1.8082 7.5027 0.3956 2.5821 1.1819 6.3100 3.5406 5.4029 8.5109 3.2533 1.1917 0.4647 1.0172 1.8094 9.6617 6.0390 5.0043 1.4985 6.1160 0.5076 2.7574 0.6738 31.1993 64.4083 15.3189 108.1446 9.3691 14.4171 4.3228 0.6954 1.0853 29.3514 2.2143 4.6354 0.3469 0.6599 0.2849 0.6698 0.0908 6.3876 4.8559 14.2292 8.7259 11.6566 0.2886 7.5851 3.3830 3.0180 0.0058 1.5736 2.8624 37.9496 1.0598 16.6264 8.1781 16.5055 16.7282 41.8519 32.5276 6.6645 27.5438 6.9984 17.2244 9.2866 23.5567 8.8491 13.6629 193.0470 13.4917 105.4619 3.2355 0.4319 96.1466 28.7429 21.2761 1.1683 3.6056 12.6498 5.9295 17.5110 24.0315 19.6721 17.2894 11.7452 10.6126
temp: 298.150 k
press: 1.00000 atm
elementType: 8 8 7 6 6 6 6 6 6 6 6 6 6 6 6 6 6 6 6 1 1 1 1 1 1 1 1 1 1 1 1 1
symmnumber: 1
zpe: 646550.4 jmol-1
zpe.correction: 0.246258 hartree
zpe.thermalcorrener: 0.262331 hartree
zpe.thermalcorrenthalpy: 0.263275 hartree
zpe.thermalcorrgfe: 0.202458 hartree
zpe.sumelectzpe: -821.329488 hartree
zpe.sumelectthermal: -821.313416 hartree
zpe.sumelectthermalent: -821.312471 hartree
zpe.sumelectthermalfe: -821.373288 hartree
dipole: 2.9310 -5.3021 1.6519
dipole: 6.2795
quadrupole: -93.0672 -116.0922 -109.8497
quadrupole: 6.7849 0.5921 -1.3156
quadrupole: 13.2692 -9.7559 -3.5133 6.7849 0.5921 -1.3156
hfenergy: -821.5757461 hartree
pointgroup: C01 [X(C16H13N1O2)]
dipole: 1.1323857 2.1924848 -0.1199242 debye
polarizability: 307.9344716|2.596018|186.0488511|0.8019322|37.4085474|111.2222878 unknown
InChI: InChI=1S/C16H13NO2/c1-19-17-15-10-6-5-9-13(15)14(11-18)16(17)12-7-3-2-4-8-12/h2-11H,1H3
charge 0 multiplicity 1
32 atoms
O  0.096111 2.286888 0.698377
O  -1.028636 -3.436728 -0.949385
N  -0.416704 0.997559 0.367508
C  0.359142 -0.113589 0.012917
C  -1.903191 -0.628983 -0.180933
C  -1.792944 0.732871 0.253109
C  -0.550185 -1.157086 -0.321011
C  1.831915 -0.086006 0.015068
C  -3.193912 -1.188913 -0.359668
C  -2.904776 1.558794 0.507446
C  -4.317515 -0.372715 -0.115168
C  -4.17688 0.981187 0.310867
C  2.560465 -0.726057 -1.028192
C  2.55349 0.565426 1.056467
C  -0.1930 -2.537589 -0.620444
C  3.971103 -0.727438 -1.020975
C  3.963566 0.562434 1.056564
C  4.678798 -0.085352 0.021604
C  0.324363 3.08825 -0.545657
H  -3.292083 -2.229003 -0.680879
H  -2.785045 2.588344 0.857525
H  -5.323378 -0.784937 -0.251095
H  -5.074049 1.581628 0.49771
H  2.018219 -1.191812 -1.857598
H  2.005278 1.058086 1.864666
H  0.889435 -2.790507 -0.518136
H  4.516229 -1.222496 -1.831881
H  4.505066 1.0598 1.868643
H  5.774269 -0.08689 0.026115
H  1.108458 2.617513 -1.163622
H  -0.616928 3.189971 -1.113486
H  0.661719 4.066351 -0.170656
