program: Gaussian 09
title: 000084997
version: EM64L-G09RevD.01
frameworkgroup: C1[X(C14H7F19O2)]
method: RPBEPBE
basis: SDD
operation: Freq
keyword: #p
keyword: freq=noraman
keyword: PBEPBE/SDD
title: #p freq=noraman PBEPBE/SDD
converged: YES YES NO NO
title: Mulliken charges:
elementType: F F F F F F F F F F F F F F F F F F F O O C C C C C C C C C C C C C C H H H H H H H
charge: -0.120353 -0.108716 -0.115916 -0.114540 -0.111929 -0.127986 -0.126217 -0.136433 -0.117850 -0.139641 -0.119342 -0.166790 -0.151737 -0.119693 -0.118579 -0.117595 -0.122551 -0.112219 -0.112642 -0.256850 -0.253575 0.258276 0.254895 0.203173 0.005455 0.202367 0.247441 0.342490 0.384714 0.409584 -0.526237 -0.338404 0.277992 -0.206781 -0.465001 0.267956 0.304353 0.260580 0.249145 0.258346 0.233173 0.247635
chargesum: 0.00000
title: Mulliken charges with hydrogens summed into heavy atoms:
elementType: F F F F F F F F F F F F F F F F F F F O O C C C C C C C C C C C C C C
charge: -0.120353 -0.108716 -0.115916 -0.114540 -0.111929 -0.127986 -0.126217 -0.136433 -0.117850 -0.139641 -0.119342 -0.166790 -0.151737 -0.119693 -0.118579 -0.117595 -0.122551 -0.112219 -0.112642 -0.256850 -0.253575 0.258276 0.254895 0.203173 0.005455 0.202367 0.247441 0.342490 0.384714 0.409584 0.046072 0.171321 0.277992 0.051565 0.015807
polarizability: 1.65020042e+02 -1.42998225e+01 1.81203972e+02 -1.71692831e+00 1.48895745e+01 1.51685530e+02
1716.lowfreq: -6.0562 -3.6513 0.0003 0.0004 0.0009 0.4608 10.6879 15.4932 26.3717
frequency: 10.4544 15.1921 26.3226 30.4592 38.9815 49.8221 58.7003 66.6966 72.2913 81.2534 92.2184 93.5374 103.9315 105.8693 125.0633 128.4045 145.9863 150.4901 163.1169 173.2859 176.5001 184.4859 210.9842 216.0371 229.9928 234.7601 237.9360 242.6458 250.2855 257.7778 264.1667 269.3221 278.3239 285.4244 287.9397 292.2909 296.1604 301.5080 313.9222 317.6738 327.5450 330.1245 335.5116 353.7356 388.2840 405.1430 410.3330 431.4637 451.7026 459.5062 464.9146 474.0140 476.3052 490.1333 504.8623 518.0847 529.1798 545.5548 562.5276 576.0019 579.0283 608.9194 628.2704 633.1520 656.9085 677.1583 754.7356 780.2361 787.9102 805.0915 842.1142 886.8471 890.0620 913.6142 937.4098 959.1899 984.5375 999.0331 999.3792 1004.6501 1005.0463 1015.7401 1016.8986 1027.9161 1035.7806 1038.3785 1042.6405 1047.5540 1057.3888 1063.5804 1068.8209 1092.2396 1106.1519 1108.3495 1110.3751 1126.7022 1132.5549 1140.9241 1153.5403 1155.8722 1163.2396 1175.3074 1180.6337 1245.5004 1280.7672 1291.6566 1361.5125 1377.7003 1412.4436 1445.9487 1449.6513 1625.1036 1640.5746 3028.1780 3040.0958 3097.5168 3105.7185 3131.1686 3164.3524 3222.0360
redmass: 7.7542 7.7323 7.6992 8.6043 17.3090 11.0661 7.7284 17.0802 14.6544 18.4288 11.2377 9.9352 5.5469 10.5630 16.8598 7.9467 4.7660 12.1829 8.3847 16.0979 15.8742 17.1019 6.2928 16.1834 16.6048 4.0765 10.5431 15.7524 17.8689 17.7387 14.9228 17.1653 16.9406 16.6441 16.4366 17.5122 14.9194 18.2282 18.6784 14.7207 14.0035 4.1556 12.0876 4.5500 9.5660 6.5772 7.4448 5.9826 17.2799 14.6996 17.3977 16.6783 3.0294 17.6515 5.4868 2.5790 12.0512 15.9350 16.6646 12.6801 16.4124 14.7816 3.9631 16.7568 16.8465 3.7887 13.0075 3.3967 3.8621 12.2735 3.0673 11.1106 11.3023 4.1661 6.4432 2.4672 13.1788 10.1238 1.4095 5.8849 1.1865 12.8494 10.7033 12.7184 10.0841 8.9758 10.5766 7.0033 7.6232 1.7289 11.1839 10.6432 4.9869 5.9669 11.8815 4.3661 12.5935 8.8079 8.5886 12.1572 11.8631 7.4871 6.1713 1.2429 1.1877 1.4150 1.4668 1.2545 1.2189 1.1042 1.0914 10.1977 4.5386 1.0625 1.0627 1.0994 1.0602 1.1034 1.0958 1.1158
irintensity: 0.0824 0.0172 0.0812 0.4798 0.0639 0.3596 4.8890 0.4658 0.6260 0.1845 0.1980 0.7973 1.7930 1.7055 0.4319 0.6377 4.8518 2.7471 0.3975 4.1183 1.6708 1.1396 1.1437 4.6174 6.2753 2.6101 1.5047 2.6098 1.2995 0.3068 2.3250 0.0540 1.0431 0.2038 0.0798 0.2637 1.5455 0.3370 0.2890 1.5489 3.8569 11.9038 3.9926 4.1646 1.2444 6.7378 12.7505 7.8371 1.1920 15.6287 1.9982 4.9172 8.2121 0.6117 3.5576 2.6409 16.2400 19.2138 8.1925 8.3224 5.9191 0.9727 11.7121 32.2866 31.0948 8.6129 221.0655 23.3541 12.1018 66.4263 32.6004 74.1428 39.6180 11.1975 31.4160 48.1736 47.9990 22.3803 49.1308 33.5872 42.5094 15.1998 34.8309 20.3420 65.3446 68.8831 118.4565 69.4672 152.3365 26.2111 51.4185 194.3951 100.2874 289.4119 308.6580 307.5117 30.6132 11.5954 51.0433 236.8482 95.9244 8.8166 16.9080 9.8694 16.6785 17.7818 37.8859 3.1774 66.1328 25.1184 20.0638 129.0789 21.4931 5.0351 20.8741 1.4426 3.2889 3.2882 2.0080 6.6375
temp: 298.150 k
press: 1.00000 atm
elementType: 9 9 9 9 9 9 9 9 9 9 9 9 9 9 9 9 9 9 9 8 8 6 6 6 6 6 6 6 6 6 6 6 6 6 6 1 1 1 1 1 1 1
symmnumber: 1
zpe: 557632.9 jmol-1
zpe.correction: 0.212391 hartree
zpe.thermalcorrener: 0.247839 hartree
zpe.thermalcorrenthalpy: 0.248783 hartree
zpe.thermalcorrgfe: 0.142888 hartree
zpe.sumelectzpe: -2582.352397 hartree
zpe.sumelectthermal: -2582.316949 hartree
zpe.sumelectthermalent: -2582.316005 hartree
zpe.sumelectthermalfe: -2582.421900 hartree
dipole: 1.2270 2.3574 -0.7744
dipole: 2.7681
quadrupole: -195.8762 -197.6325 -194.8654
quadrupole: 8.9182 -5.5467 8.5434
quadrupole: 0.2485 -1.5078 1.2593 8.9182 -5.5467 8.5434
hfenergy: -2582.564788 hartree
pointgroup: C01 [X(C14H7F19O2)]
dipole: 0.0933142 -1.0763355 0.1373269 debye
polarizability: 178.5965116|15.2422481|164.2348605|8.4994716|14.2316741|155.0781723 unknown
InChI: InChI=1S/C14H7F19O2/c1-2-5(34)35-4-3-6(15,16)8(18,19)10(22,23)12(26,27)11(24,25)9(20,21)7(17,13(28,29)30)14(31,32)33/h2H,1,3-4H2
charge 0 multiplicity 1
42 atoms
F  -1.575854 1.560516 -2.059969
F  -0.699518 3.388476 -1.033201
F  -1.416096 2.421527 1.453983
F  -3.076357 2.879851 -0.056359
F  1.0951 1.558737 -1.928464
F  0.142375 -0.135987 -0.717132
F  -1.853855 -0.253693 1.300793
F  0.845162 0.906346 1.626324
F  1.302723 2.967479 0.742117
F  3.454826 1.556826 1.612097
F  3.463843 2.039904 -0.618451
F  4.722881 -0.273282 0.008626
F  2.844843 -0.600415 -1.251602
F  -4.32313 -1.181277 -0.065083
F  -4.130784 0.628585 -1.414697
F  -2.436591 -0.876878 -1.250742
F  -5.148985 1.261552 1.124744
F  -3.613355 1.875505 2.665592
F  -4.196282 -0.289169 2.4868
O  3.184961 -3.377439 -0.32204
O  1.069962 -3.870985 0.5435
C  -0.982321 2.016085 -0.859048
C  -2.071001 1.942581 0.291952
C  0.407845 1.254812 -0.733509
C  -2.814357 0.600232 0.675152
C  1.353919 1.581264 0.483445
C  2.885233 1.200395 0.354014
C  3.291217 -0.292716 0.071583
C  -3.431585 -0.208021 -0.538079
C  -3.955959 0.875402 1.754886
C  2.823392 -1.323933 1.089601
C  3.51449 -2.694259 0.950756
C  1.896318 -3.937687 -0.400614
C  1.708895 -4.585241 -1.720394
C  0.547718 -5.217362 -2.03285
H  3.050446 -0.933214 2.098708
H  1.730917 -1.454471 1.023351
H  4.610258 -2.603892 0.931004
H  3.192349 -3.328442 1.79537
H  2.550757 -4.521121 -2.41676
H  0.402485 -5.696231 -3.006493
H  -0.275186 -5.259859 -1.30971
