program: Gaussian 09
title: 000084712
version: EM64L-G09RevD.01
frameworkgroup: C1[X(C10H12NS)]
method: RPBEPBE
basis: SDD
operation: Freq
keyword: #p
keyword: freq=noraman
keyword: PBEPBE/SDD
title: #p freq=noraman PBEPBE/SDD
converged: YES YES NO NO
title: Mulliken charges:
elementType: S N C C C C C C C C C C H H H H H H H H H H H H
charge: 0.409218 -0.145991 0.656487 -0.387727 -0.013296 -0.389234 -0.315242 -0.631950 -0.249195 -0.709731 -0.201783 -0.212689 0.260399 0.261852 0.270737 0.232848 0.264406 0.247628 0.277063 0.275653 0.282756 0.280750 0.266420 0.270618
chargesum: 1.00000
title: Mulliken charges with hydrogens summed into heavy atoms:
elementType: S N C C C C C C C C C C
charge: 0.409218 -0.145991 0.656487 0.134524 -0.013296 -0.389234 -0.044505 0.112933 0.027868 0.129429 0.064637 0.057929
polarizability: 1.73507342e+02 8.24556951e+00 1.38291097e+02 4.38371306e+00 -6.53332591e+00 6.40069817e+01
1716.lowfreq: -0.0022 -0.0012 -0.0007 3.7294 7.5006 10.7575 79.9404 97.1839 125.0613
frequency: 79.9276 97.1593 125.0592 143.7164 189.0024 203.4019 248.6913 276.4732 325.6125 380.8929 405.4510 429.3986 468.5758 497.6413 504.8678 534.0809 623.3355 652.8404 683.2980 730.4822 765.3346 771.4013 809.4442 866.5186 924.5902 963.5163 986.6812 1007.9338 1019.9961 1021.8653 1032.5558 1072.5555 1094.5319 1142.5672 1144.7107 1183.4449 1207.6612 1260.4325 1285.5419 1300.3183 1349.5231 1401.9168 1406.7926 1408.8631 1434.9513 1451.7484 1456.5734 1459.3845 1471.4087 1480.4871 1489.7853 1516.3555 1591.4490 1595.7316 2990.3859 3005.6124 3048.2633 3072.1189 3096.2487 3108.6185 3118.9535 3121.6796 3161.0777 3168.8521 3178.6462 3190.1173
redmass: 2.5869 3.4813 3.3538 1.0553 4.1729 1.1575 3.0741 3.8097 2.2212 4.0925 6.1173 3.0866 5.3153 7.1990 4.5294 4.0207 4.3490 4.5876 5.7372 3.2829 2.3524 1.4209 1.3969 1.3478 2.8221 1.3639 2.1413 1.3528 1.4890 3.5583 2.6353 2.5851 1.9864 1.7577 1.5124 1.2681 2.0904 1.7787 1.5587 1.7997 1.3791 2.0613 2.0353 1.1899 2.3415 2.0803 1.1828 1.0804 1.0428 1.1036 1.7085 1.7003 7.1195 6.6679 1.0402 1.0366 1.0618 1.0969 1.1019 1.1003 1.1014 1.1001 1.0879 1.0908 1.0963 1.1010
irintensity: 0.1907 0.0337 4.2020 0.0678 0.3499 0.2519 1.3176 1.1576 0.0593 5.9152 0.4510 7.7741 1.0399 0.6935 2.0131 6.0446 1.3475 1.2482 8.2697 8.5412 5.0211 88.5212 2.3422 0.0295 2.7193 0.7938 3.0429 0.0560 2.7403 5.1012 1.3504 3.1650 15.7645 2.8085 4.0439 13.6261 40.1134 17.3387 5.0331 21.8253 1.0061 18.0292 10.1156 19.9819 42.2521 23.3142 21.0977 31.4144 19.1640 7.9627 10.5324 24.6595 10.5456 5.7781 2.1557 4.6205 8.4354 0.5655 2.5538 9.2910 9.4726 4.7419 0.4102 1.3393 0.3993 0.8496
temp: 298.150 k
press: 1.00000 atm
elementType: 16 7 6 6 6 6 6 6 6 6 6 6 1 1 1 1 1 1 1 1 1 1 1 1
symmnumber: 1
zpe: 515812.1 jmol-1
zpe.correction: 0.196462 hartree
zpe.thermalcorrener: 0.207750 hartree
zpe.thermalcorrenthalpy: 0.208694 hartree
zpe.thermalcorrgfe: 0.159532 hartree
zpe.sumelectzpe: -839.979939 hartree
zpe.sumelectthermal: -839.968651 hartree
zpe.sumelectthermalent: -839.967707 hartree
zpe.sumelectthermalfe: -840.016869 hartree
dipole: -2.4465 1.0401 -0.5105
dipole: 2.7070
quadrupole: -40.7627 -57.1190 -78.0304
quadrupole: -0.0442 2.0400 -1.8909
quadrupole: 17.8747 1.5183 -19.3930 -0.0442 2.0400 -1.8909
hfenergy: -840.176401 hartree
pointgroup: C01 [X(C10H12N1S1)]
dipole: 0.9674654 -0.3970183 -0.201538 debye
dipolederiv: -0.2025342 0.1028158 0.0270463 0.1446515 -0.0060567 -0.0218949 0.0587427 -0.0439194 0.2105432 -0.204721 -0.0636291 -0.0051969 0.1132832 -0.7203593 -0.021973 0.0116373 -0.0546678 -0.0947787 0.024038 0.0177085 0.0273961 0.1704624 -0.0817311 -0.0225421 0.0361651 -0.026928 0.0594376 0.3185504 -0.2410555 0.0092105 -0.2411833 0.426796 -0.0114491 -0.0191503 0.05631 0.206607 0.5307729 -0.0475241 -0.0837894 -0.2688338 0.7705835 0.0863283 -0.1211565 0.0974215 -0.0052424 0.3292801 0.3434335 0.0178842 0.0502953 -0.0031084 0.0156593 -0.0274202 -0.0190015 -0.0734876 0.0223708 -0.0226346 -0.0165037 -0.0049801 0.0441441 0.0105372 -0.0134066 0.0290534 -0.1233232 -0.000221 0.0678781 0.0023132 0.0719693 -0.0368148 0.0123011 0.0262516 -0.0228179 -0.0249368 -0.0949338 -0.1309054 -0.0193849 -0.209334 0.012701 0.0275093 -0.0269768 0.0217177 -0.0693896 -0.3515172 -0.103727 0.0261062 0.1075976 -0.0057065 -0.0086222 0.1142562 0.0295712 0.0109566 -0.0800905 0.0858945 0.0107792 0.1984219 0.1343142 0.0206637 0.0227419 0.0239649 -0.1033666 0.1415894 -0.0383205 -0.0261646 -0.0725654 -0.026069 0.0172273 -0.0301626 0.0133488 -0.0994632 0.0346178 -0.0298951 -0.1158763 0.0206664 0.0136126 -0.0311298 -0.0702392 -0.0167363 0.0219925 -0.0199844 -0.0033051 0.0662861 -0.0525275 0.0297639 0.0821028 0.0271741 0.0398949 0.0586205 0.0703309 0.0707448 0.021386 0.0549017 0.0215155 -0.0165214 0.0207309 -0.0218206 0.1621349 0.0619747 -0.0567558 -0.0646232 -0.0980139 0.0103943 -0.084084 -0.0430529 -0.0361533 0.0112637 0.060527 0.0895831 0.020049 0.0990431 -0.0185706 -0.0232122 0.0143089 -0.0084979 0.0839868 -0.0524399 -0.0608035 0.0782023 -0.0410506 0.1108404 0.023467 0.0448112 0.0076489 0.0544101 0.1096214 -0.0037449 0.0044621 0.0325513 0.0261172 -0.0225333 0.0095412 -0.0199793 0.1687047 0.0567333 0.0192727 -0.0148242 0.0118532 0.0565239 0.0883123 -0.0414959 0.0624569 0.065165 0.0644518 -0.0109476 0.0079583 -0.0200328 0.1206603 -0.0612869 0.0014581 -0.0430124 0.0130697 0.1355888 0.0573621 0.0121976 -0.0088086 -0.0005369 -0.034174 -0.0116173 -0.0432395 0.1398934 0.0592629 -0.0543052 -0.0003344 -0.0561447 0.022753 -0.0157295 0.0020051 -0.0152204 0.1623523 -0.0132679 0.0128601 0.0154206 -0.0022221 0.0982334 -0.0089557 0.0148541 -0.0093941 0.1648502 unknown
polarizability: 173.182334|8.7564475|138.7167202|-5.293405|5.3868562|63.9063669 unknown
InChI: InChI=1S/C10H12NS/c1-3-11-8(2)12-10-7-5-4-6-9(10)11/h4-7H,3H2,1-2H3
charge 1 multiplicity 1
24 atoms
S  0.388669 2.284133 0.157574
N  1.094654 -0.203189 -0.249435
C  -0.325299 -0.270461 -0.134226
C  1.927642 -1.436983 -0.441182
C  1.623927 1.035464 -0.120291
C  -0.903602 1.008307 0.087651
C  -1.140303 -1.421144 -0.229297
C  2.174702 -2.179351 0.88623
C  -2.292488 1.182525 0.2220
C  3.076923 1.370243 -0.207918
C  -2.531267 -1.251875 -0.096369
C  -3.102495 0.030669 0.126993
H  1.396809 -2.073258 -1.16892
H  2.877784 -1.133068 -0.907494
H  -0.717863 -2.414918 -0.400427
H  2.736205 -1.556576 1.603522
H  2.77197 -3.084874 0.684331
H  1.231991 -2.493162 1.364473
H  -2.735345 2.167593 0.391901
H  3.676414 0.758703 0.49033
H  3.465313 1.19741 -1.229848
H  3.251127 2.428925 0.03738
H  -3.18507 -2.126008 -0.16663
H  -4.187397 0.128894 0.226053
