program: Gaussian 09
title: 000084686
version: EM64L-G09RevD.01
frameworkgroup: C1[X(C6H4N2O)]
method: RPBEPBE
basis: SDD
operation: Freq
keyword: #pfreq=noraman
keyword: PBEPBE/SDD
title: #p freq=noraman PBEPBE/SDD
converged: NO YES YES YES
title: Mulliken charges:
elementType: O N N C C C C C C H H H H
charge: -0.322772 0.043862 0.002206 0.372792 -0.314411 -0.320879 -0.199935 -0.152002 -0.229900 0.310040 0.275819 0.289312 0.245868
chargesum: 0.00000
title: Mulliken charges with hydrogens summed into heavy atoms:
elementType: O N N C C C C C C
charge: -0.322772 0.043862 0.002206 0.372792 -0.004371 -0.045060 0.089377 0.093866 -0.229900
polarizability: 1.24667762e+02 3.16509145e+00 8.90258903e+01 -2.35339898e-03 2.11473996e-04 3.06810802e+01
1716.lowfreq: -6.8208 -0.0006 0.0002 0.0007 15.6549 15.7596 143.6367 147.4774 194.3044
frequency: 143.6249 147.4745 194.3024 387.3005 420.6488 456.8947 467.8529 534.7114 565.9127 626.0189 669.8660 720.8438 794.8935 868.2778 885.4268 937.7243 970.7668 995.6046 1086.9065 1153.2775 1171.6865 1272.6737 1279.8920 1301.0252 1409.5518 1473.0460 1535.6070 1603.8803 2190.0174 3170.5373 3195.1323 3213.7193 3217.6910
redmass: 6.3942 9.1738 5.0165 4.8455 9.3950 8.3905 3.7367 8.5299 6.6993 5.6646 2.0952 7.7345 1.4470 1.5582 1.4202 3.5811 1.3200 6.0028 1.6871 2.4596 1.1279 5.5838 5.3262 1.3345 2.3520 3.2885 4.9568 5.9927 12.6283 1.0893 1.0962 1.0945 1.0980
irintensity: 2.3728 5.4090 2.8882 0.1125 1.8634 1.7858 5.8636 5.9063 0.3119 0.1711 30.1520 0.7472 61.2938 38.6001 1.6538 6.0790 0.5367 26.8678 4.2468 20.2853 12.7616 64.4484 16.3799 3.4978 31.6083 19.0699 16.7353 37.4318 10.0051 4.2434 0.6857 3.2312 1.8362
temp: 298.150 k
press: 1.00000 atm
elementType: 8 7 7 6 6 6 6 6 6 1 1 1 1
symmnumber: 1
zpe: 233647.4 jmol-1
zpe.correction: 0.088992 hartree
zpe.thermalcorrener: 0.096015 hartree
zpe.thermalcorrenthalpy: 0.096959 hartree
zpe.thermalcorrgfe: 0.057311 hartree
zpe.sumelectzpe: -415.065557 hartree
zpe.sumelectthermal: -415.058534 hartree
zpe.sumelectthermalent: -415.057590 hartree
zpe.sumelectthermalfe: -415.097238 hartree
dipole: -1.2775 3.9941 0.0001
dipole: 4.1934
quadrupole: -68.4001 -47.1434 -52.7584
quadrupole: -4.7506 0.0004 0.0000
quadrupole: -12.2995 8.9573 3.3422 -4.7506 0.0004 0.0000
hfenergy: -415.1545488 hartree
pointgroup: C01 [X(C6H4N2O1)]
dipole: -0.5356859 -1.5604261 -0.0000274 debye
dipolederiv: -0.7355386 0.3835532 -0.0000156 0.4546686 -0.681785 0.000017 0.0000082 -0.000008 -0.3126161 0.6516373 -0.5800435 0.000012 -0.6468128 0.5565308 -0.0000155 -0.0000032 0.0000045 0.119198 -0.2998469 -0.0128646 -0.0000004 -0.0280369 -0.2113348 -0.0000003 -0.0000014 -0.000001 -0.2271053 0.1498827 -0.1171585 -0.0000002 -0.0020867 0.3418619 0.0000009 -0.0000014 -0.0000037 0.1526105 -0.2643946 0.329151 0.0000038 -0.1262394 0.033884 -0.0000032 -0.0000034 0.0000077 -0.1173383 -0.2094814 -0.0899734 -0.0000006 -0.011092 -0.1604199 -0.000002 0.0000029 -0.0000065 -0.1732305 0.0755508 -0.0600384 0.0000024 0.3059252 -0.2024146 0.000001 0.0000027 -0.0000039 -0.1268832 0.1494624 0.0881305 0.0000055 -0.0298148 0.1595728 -0.0000021 0.0000062 0.0000037 -0.0773251 0.2356531 0.0480353 0.0000051 0.0841354 -0.0159994 0.000002 0.0000045 0.0000043 0.0300255 0.0782574 0.016977 -0.0000042 -0.0151106 0.0752317 -0.0000007 -0.0000041 -0.0000003 0.1963033 0.0409955 0.0570159 -0.0000038 0.0469227 0.053111 0.0000017 -0.0000046 0.0000033 0.1844829 0.0438686 -0.0120446 -0.0000027 0.0280783 0.0821632 0.000002 -0.0000024 0.000001 0.1914828 0.0839536 -0.05074 -0.0000014 -0.060537 -0.0304014 -0.0000008 -0.0000038 -0.0000012 0.1603954 unknown
polarizability: 124.5181232|-3.9152051|89.1755294|0.0023573|0.0001617|30.6810802 unknown
InChI: InChI=1S/C6H4N2O/c7-4-6-2-1-3-8(9)5-6/h1-3,5H
charge 0 multiplicity 1
13 atoms
O  -2.411384 1.588236 -0.000032
N  -1.499855 0.623922 -0.000045
N  3.381707 0.591167 0.000114
C  0.833614 -0.081847 0.000029
C  -0.141064 0.935774 0.000006
C  0.449147 -1.451636 0.000017
C  -1.885788 -0.721186 -0.000038
C  -0.932693 -1.744327 -0.000012
C  2.224784 0.290682 0.000074
H  0.084245 2.0024 0.000019
H  1.203841 -2.240398 0.00004
H  -2.965552 -0.874425 -0.000055
H  -1.284903 -2.779462 -0.000016
