program: Gaussian 09
title: 000084648
version: EM64L-G09RevD.01
frameworkgroup: C1[X(C6H9ClO3)]
method: RPBEPBE
basis: SDD
operation: Freq
keyword: #p
keyword: freq=noraman
keyword: PBEPBE/SDD
title: #p freq=noraman PBEPBE/SDD
converged: NO NO NO NO
title: Mulliken charges:
elementType: Cl O O O C C C C C C H H H H H H H H H
charge: -0.089342 -0.260750 -0.242642 -0.095475 -0.505320 -0.377188 0.255238 -0.229673 -0.669605 -0.037294 0.267594 0.266833 0.289885 0.285391 0.232080 0.231596 0.214904 0.232014 0.231754
chargesum: 0.00000
title: Mulliken charges with hydrogens summed into heavy atoms:
elementType: Cl O O O C C C C C C
charge: -0.089342 -0.260750 -0.242642 -0.095475 0.029108 0.198088 0.255238 0.234003 0.009067 -0.037294
polarizability: 1.16704758e+02 1.04927117e+01 8.24422566e+01 -2.27951861e-01 -4.24088666e-01 5.24942593e+01
1716.lowfreq: -6.7089 0.0026 0.0030 0.0030 1.9033 5.9511 22.5861 37.0622 65.2750
frequency: 5.7851 36.9183 64.8817 71.0925 89.2755 149.7289 164.2873 216.3251 251.9755 280.9645 353.5257 393.5622 457.9876 461.3365 546.2522 626.3944 741.4846 772.1283 799.5984 811.6890 922.8736 962.2892 1008.0695 1020.0462 1080.0666 1112.9903 1136.1223 1144.4568 1149.8860 1248.8758 1260.3770 1273.5397 1350.4013 1367.8944 1403.4951 1425.0631 1445.6545 1464.3437 1473.9946 1486.6370 1633.7907 1754.2406 2996.0276 3011.9227 3013.2838 3020.6197 3056.0998 3071.3653 3076.8129 3093.4813 3106.5319
redmass: 9.0205 3.9685 2.7280 5.1749 2.1009 2.0017 5.6460 8.4871 1.2584 7.1771 3.6835 16.9078 3.7923 2.9803 2.6085 7.9911 6.6284 1.5650 1.1070 3.7506 5.2544 4.3335 2.1973 2.2924 3.1848 2.2493 1.4651 2.3603 1.3170 1.1354 1.1268 1.5598 1.4269 1.7362 1.2657 1.0853 1.0904 1.0398 1.0631 1.0680 9.6950 10.9634 1.0358 1.0590 1.0624 1.0606 1.0983 1.1066 1.0993 1.0986 1.1030
irintensity: 3.1105 2.1144 0.3207 1.2662 1.4741 10.6570 5.4893 6.6499 1.7476 17.4893 2.0811 16.0894 23.6611 6.4697 1.0641 64.3065 110.9532 18.8600 3.6752 33.1291 6.6558 60.9462 0.3363 39.0585 80.2803 5.2588 7.7152 251.6221 55.6420 0.0428 14.4912 194.0284 3.9209 11.9307 18.7597 29.4571 42.2508 12.5362 4.6004 14.7914 185.4353 228.5026 18.7551 12.5325 6.4420 13.1665 0.7367 5.5485 4.0062 27.4024 44.2094
temp: 298.150 k
press: 1.00000 atm
elementType: 17 8 8 8 6 6 6 6 6 6 1 1 1 1 1 1 1 1 1
symmnumber: 1
zpe: 376024.9 jmol-1
zpe.correction: 0.143220 hartree
zpe.thermalcorrener: 0.155158 hartree
zpe.thermalcorrenthalpy: 0.156102 hartree
zpe.thermalcorrgfe: 0.101098 hartree
zpe.sumelectzpe: -918.994279 hartree
zpe.sumelectthermal: -918.982342 hartree
zpe.sumelectthermalent: -918.981398 hartree
zpe.sumelectthermalfe: -919.036402 hartree
dipole: 4.4384 0.1454 0.1188
dipole: 4.4423
quadrupole: -66.9580 -74.7953 -62.9123
quadrupole: 3.5520 -0.0495 -0.0893
quadrupole: 1.2639 -6.5735 5.3096 3.5520 -0.0495 -0.0893
hfenergy: -919.1374998 hartree
pointgroup: C01 [X(C6H9Cl1O3)]
dipole: -1.739134 -0.1643296 0.0551301 debye
dipolederiv: -0.9144779 -0.3932534 -0.0205795 -0.4683647 -0.5215871 -0.0199689 -0.0229491 -0.0192271 -0.1572994 -1.7285613 -0.3360864 0.0243505 -0.3472285 -0.5900074 0.0128225 0.0287169 0.0138613 -0.2801925 -0.731089 0.062028 0.0004351 -0.3024276 -0.9055974 0.0207287 0.015336 0.0128639 -0.2993505 -0.5656749 0.0476126 0.0043562 -0.2999131 -1.1055047 -0.0523123 -0.0167145 -0.0566909 -0.2043841 -0.263093 0.0770976 0.0021744 0.3109612 -0.1130439 -0.0016867 0.0135793 -0.0054774 0.1383136 -0.226168 0.0782302 0.0069506 0.1889385 -0.2122258 -0.0158043 -0.001907 -0.009891 0.099697 1.7482157 0.1579359 -0.0213359 0.5401583 1.2406167 -0.0338534 -0.041002 -0.0255282 0.1792534 0.9316518 0.0645145 -0.0079596 -0.1325885 0.2283741 0.0038987 -0.0033183 0.0010351 0.3507376 -0.1108677 -0.0824046 0.0056789 -0.0612168 -0.0008059 0.0047264 0.0054074 0.0046973 0.0588177 1.6207872 0.2889085 0.0101817 0.7034888 1.6108461 0.0832598 0.0361213 0.0854869 0.1422708 0.0626891 0.0123708 -0.0060681 -0.047911 0.0631284 -0.0701564 -0.0062677 -0.0747432 0.0035245 0.0586091 0.0062652 0.0091284 -0.0506347 0.0549686 0.0732271 0.0012479 0.080331 0.0091053 0.0680466 -0.0084796 0.0145109 -0.0833046 0.0904731 0.0601108 0.014196 0.061014 0.0455737 0.0545238 -0.0099131 -0.0163894 -0.0763899 0.0959329 -0.0567054 -0.0150223 -0.0609667 0.0299767 -0.0440487 -0.03574 -0.0258154 0.0558155 -0.005155 -0.0916484 0.0107477 -0.1019611 -0.0476787 -0.0451552 -0.0299534 0.0264213 0.0573868 0.0100187 0.0866113 -0.0157596 0.099783 -0.0656659 -0.1408549 0.0638167 0.0012755 0.0863961 0.0410874 0.0014966 0.0006877 0.0020086 0.1176342 0.1133995 0.0179966 0.0325074 -0.0381373 0.0002034 -0.1025035 0.0076965 -0.1176908 -0.0516458 0.1120679 0.0190538 -0.039823 -0.0350286 0.0182776 0.0977575 -0.0107962 0.1110951 -0.0686877 unknown
polarizability: 115.3003442|12.5036213|83.8314581|-0.0127054|0.7817585|52.5094712 unknown
InChI: InChI=1S/C6H9ClO3/c1-2-10-6(9)4-3-5(7)8/h2-4H2,1H3
charge 0 multiplicity 1
19 atoms
Cl 4.352356 0.868414 0.021105
O  -2.072437 -0.439628 0.010716
O  -1.014759 1.638992 -0.05596
O  3.03052 -1.528517 -0.116659
C  0.318422 -0.445507 -0.023588
C  1.561107 0.462899 0.008214
C  -0.955306 0.386852 -0.026423
C  -3.406312 0.251215 0.005248
C  -4.463256 -0.845293 0.070775
C  2.848938 -0.320381 -0.039786
H  0.32023 -1.095252 -0.918405
H  0.297517 -1.132317 0.842094
H  1.55821 1.179937 -0.83409
H  1.575544 1.099815 0.912301
H  -3.440389 0.93419 0.873163
H  -3.472594 0.857824 -0.915986
H  -5.469755 -0.389214 0.069203
H  -4.388423 -1.522345 -0.797696
H  -4.356313 -1.445684 0.990673
