program: Gaussian 09
title: 000084647
version: EM64L-G09RevD.01
frameworkgroup: C1[X(C14H11NO4)]
method: RPBEPBE
basis: SDD
operation: Freq
keyword: #p
keyword: freq=noraman
keyword: PBEPBE/SDD
title: #p freq=noraman PBEPBE/SDD
converged: YES YES NO YES
title: Mulliken charges:
elementType: O O O O N C C C C C C C C C C C C C C H H H H H H H H H H H
charge: -0.281848 -0.245622 -0.200746 -0.201302 0.027536 0.474845 -0.431352 0.234244 -0.384892 -0.384913 -0.319899 -0.307823 0.204332 0.387786 -0.350264 -0.344411 -0.223320 -0.223320 -0.229079 0.239990 0.239982 0.282086 0.287664 0.235836 0.235834 0.291366 0.290035 0.231675 0.231675 0.233905
chargesum: 0.00000
title: Mulliken charges with hydrogens summed into heavy atoms:
elementType: O O O O N C C C C C C C C C C C C C C
charge: -0.281848 -0.245622 -0.200746 -0.201302 0.027536 0.474845 0.048621 0.234244 -0.149056 -0.149079 -0.037813 -0.020159 0.204332 0.387786 -0.058898 -0.054376 0.008355 0.008355 0.004825
polarizability: 2.49878140e+02 -1.51143647e+01 1.72892792e+02 -1.27563130e-02 1.46561040e-02 1.11218865e+02
1716.lowfreq: -7.6565 -0.0008 -0.0005 0.0002 3.4384 3.7303 9.5222 22.6405 36.7347
frequency: 7.2376 22.3476 36.7344 45.0870 63.5075 77.7628 114.4500 140.1675 199.4367 212.8704 263.4505 279.3449 300.4312 321.9448 403.3064 410.5424 430.3794 459.0986 484.9074 505.7831 525.9194 572.6689 617.2731 623.7912 653.3740 678.7676 686.1333 702.5127 756.8223 764.5592 764.9247 800.8735 854.0498 860.5597 864.8141 866.1672 889.6114 933.0465 943.3127 978.5002 991.1426 999.6779 1005.2819 1006.2629 1012.8760 1026.8980 1057.8916 1089.2862 1089.6145 1109.8803 1174.6268 1177.4050 1188.4607 1189.4670 1213.7244 1228.4559 1241.3798 1293.9933 1326.1583 1350.5944 1368.4046 1386.4130 1405.8620 1415.0286 1441.2266 1468.0430 1475.6086 1487.8814 1589.3636 1596.5258 1609.5803 1617.1416 1619.3292 3018.2471 3083.6852 3124.7216 3126.2153 3138.3341 3152.0299 3164.9050 3167.5524 3175.4393 3188.4106 3193.0595
redmass: 4.6582 3.9852 6.8671 8.4076 6.7879 7.3221 6.4779 6.0617 6.6955 9.0143 7.4327 7.8292 6.6090 2.1559 2.7917 2.8926 5.5815 4.0996 9.3986 5.0295 5.1887 4.9433 6.3346 7.1227 6.2137 8.5122 3.9422 1.8111 2.0038 5.1538 7.0106 7.1987 1.2476 4.1289 6.3067 1.2403 1.6600 1.5940 1.6339 1.3935 6.2424 1.3249 3.4710 1.3388 1.3677 2.1768 5.1652 1.5185 3.2433 1.3204 1.0545 1.2338 1.1183 1.0891 6.5867 2.4448 3.8889 1.2622 1.2748 1.5351 7.8161 8.8090 8.6605 4.3617 2.1929 1.0988 2.4279 2.4330 9.0896 6.1290 6.4883 6.6625 9.0237 1.0577 1.1079 1.0857 1.0886 1.0918 1.0962 1.0901 1.1016 1.0892 1.0958 1.0975
irintensity: 0.2447 0.0223 0.0902 0.1099 0.8321 2.2653 0.6532 5.6070 1.0410 12.1733 0.0210 4.7741 0.6041 1.2649 0.0002 0.0007 3.4569 1.3255 9.7279 2.0115 12.6018 13.2485 0.0944 0.4222 0.0098 8.8255 54.9976 46.3960 102.2009 3.2503 6.2669 8.4689 0.0141 22.4247 75.1973 0.1980 54.6024 0.7146 1.6632 0.0029 2.2905 0.1709 54.7530 0.5035 0.0265 6.0486 364.5364 7.2382 11.5702 9.2663 0.0006 5.4115 4.7410 1.9624 548.9995 18.1110 182.8550 0.3522 0.2372 15.1782 82.0667 0.5541 6.5383 72.2067 9.6742 6.9586 3.9022 6.0034 65.3821 0.7733 11.1132 20.6654 119.5114 15.3085 10.4876 5.1435 2.7655 13.1482 35.5457 1.4801 19.0509 1.0305 0.4820 0.4482
temp: 298.150 k
press: 1.00000 atm
elementType: 8 8 8 8 7 6 6 6 6 6 6 6 6 6 6 6 6 6 6 1 1 1 1 1 1 1 1 1 1 1
symmnumber: 1
zpe: 579606.0 jmol-1
zpe.correction: 0.220760 hartree
zpe.thermalcorrener: 0.236992 hartree
zpe.thermalcorrenthalpy: 0.237936 hartree
zpe.thermalcorrgfe: 0.172243 hartree
zpe.sumelectzpe: -894.323926 hartree
zpe.sumelectthermal: -894.307694 hartree
zpe.sumelectthermalent: -894.306750 hartree
zpe.sumelectthermalfe: -894.372443 hartree
dipole: 5.6701 0.0220 -0.0007
dipole: 5.6701
quadrupole: -126.5731 -114.9518 -102.5051
quadrupole: -16.7878 -0.0014 -0.0037
quadrupole: -11.8965 -0.2752 12.1716 -16.7878 -0.0014 -0.0037
hfenergy: -894.5446866 hartree
pointgroup: C01 [X(C14H11N1O4)]
dipole: 2.230694 0.0212618 -0.0002901 debye
polarizability: 250.0464139|-14.6785922|172.7245179|-0.0128389|0.0145838|111.2188648 unknown
InChI: InChI=1S/C14H11NO4/c16-14(19-10-11-4-2-1-3-5-11)12-6-8-13(9-7-12)15(17)18/h1-9H,10H2
charge 0 multiplicity 1
30 atoms
O  1.136786 0.754905 0.000055
O  0.151199 2.870067 0.000777
O  -6.110925 -0.386183 0.000234
O  -5.050794 -2.40554 -0.000635
N  -5.04627 -1.115209 -0.000484
C  3.535872 0.340265 0.000303
C  2.491024 1.425211 0.000438
C  -1.255227 0.874546 0.000009
C  4.034094 -0.177732 1.222527
C  4.034621 -0.176922 -1.222047
C  -2.453405 1.634966 0.000376
C  -1.307312 -0.543763 -0.000515
C  0.044266 1.618595 0.000181
C  -3.728672 -0.423187 -0.000318
C  -3.702614 0.98905 0.000218
C  -2.551072 -1.20272 -0.000683
C  5.010362 -1.198396 1.224207
C  5.010891 -1.197585 -1.223982
C  5.500505 -1.710387 0.000049
H  2.539384 2.068638 0.896446
H  2.539651 2.069114 -0.895214
H  -2.381181 2.726897 0.000776
H  -0.373819 -1.112033 -0.000786
H  3.655668 0.219012 2.172407
H  3.656606 0.22045 -2.171827
H  -4.643011 1.545621 0.000493
H  -2.627346 -2.292865 -0.001085
H  5.390281 -1.590528 2.173887
H  5.391221 -1.589087 -2.173757
H  6.260417 -2.499701 -0.000048
