program: Gaussian 09
title: 000084632
version: EM64L-G09RevD.01
frameworkgroup: C1[X(C7H16O2Si)]
method: RPBEPBE
basis: SDD
operation: Freq
keyword: #p
keyword: freq=noraman
keyword: PBEPBE/SDD
title: #p freq=noraman PBEPBE/SDD
converged: YES YES NO NO
title: Mulliken charges:
elementType: Si O O C C C C C C C H H H H H H H H H H H H H H H H
charge: 1.469701 -0.571310 -0.571305 0.230482 -0.324575 -0.324587 -0.722600 -0.685134 -1.049335 -1.044198 0.216268 0.182440 0.182439 0.216271 0.208467 0.219674 0.219675 0.204274 0.204274 0.250596 0.247210 0.242217 0.247210 0.246235 0.259376 0.246235
chargesum: 0.00000
title: Mulliken charges with hydrogens summed into heavy atoms:
elementType: Si O O C C C C C C C
charge: 1.469701 -0.571310 -0.571305 0.230482 0.074133 0.074123 -0.074784 -0.025990 -0.312698 -0.292353
polarizability: 1.19273317e+02 1.65822503e+00 9.77710430e+01 -1.26483952e-04 -1.98283054e-05 8.67017033e+01
1716.lowfreq: -0.0020 -0.0018 -0.0009 12.7349 17.2569 19.0873 54.3157 98.6012 103.8903
frequency: 54.2388 98.5790 103.7641 140.3592 159.1286 162.6193 185.0332 200.0915 213.2688 224.3827 258.4065 296.2008 308.3267 365.1949 377.4318 392.2855 441.2545 546.4563 584.4947 664.2173 715.5394 731.7069 760.5072 805.0326 841.5041 890.5661 901.9069 902.7222 918.6018 932.5072 943.3750 986.9364 997.8705 1020.0487 1055.3572 1172.0439 1192.7983 1194.7984 1268.7032 1299.5242 1306.8070 1316.9279 1333.0117 1357.6791 1380.1577 1400.1103 1435.7533 1440.1187 1444.4817 1450.9908 1457.5582 1459.6127 1465.2448 1478.3439 1480.6015 1486.9988 2922.4156 2930.6274 2968.4737 2980.5562 2987.0188 2998.9315 3039.1123 3044.0931 3062.6309 3067.8148 3072.7588 3091.2367 3092.6031 3095.1851 3101.9076 3111.4940
redmass: 3.4504 1.0738 2.1710 1.0246 1.1561 2.9523 2.4503 2.7373 1.5132 1.6713 2.3550 3.1044 4.3128 2.9514 2.8135 2.1874 3.3935 5.5113 4.1631 4.5614 2.9851 2.6699 3.7156 1.2401 2.0094 1.7311 1.7680 2.1863 1.5771 1.3756 1.3795 5.2048 2.5686 1.5209 3.0709 2.0162 1.2881 1.9017 2.1247 1.7832 1.2165 1.2023 1.1870 1.2860 1.2049 1.2073 1.0510 1.0539 1.0483 1.0490 1.0729 1.0586 1.0476 1.0774 1.0560 1.0602 1.0671 1.0671 1.0356 1.0367 1.0346 1.0349 1.0958 1.0969 1.0990 1.1000 1.0989 1.0979 1.0983 1.0978 1.0980 1.0985
irintensity: 2.6265 0.1176 0.0064 0.1154 0.0065 0.6528 0.7917 0.2579 0.3505 0.2324 1.5529 6.4740 42.7678 4.6538 8.1012 5.8571 8.2293 5.8895 3.8012 34.3780 35.1215 19.5183 11.9136 0.8247 99.7919 10.4395 99.4447 12.3058 145.1340 23.0184 4.0612 1.0479 159.2976 1.2429 242.2272 5.0679 0.0013 6.6009 0.7304 1.3785 60.5183 42.6439 0.1691 3.9259 23.2737 24.0780 5.8824 0.2024 5.5566 18.6307 0.0123 1.2468 0.1231 11.5831 10.1517 24.0494 23.7060 118.9614 43.9800 27.0110 8.8215 5.7424 29.2685 26.4286 50.9411 0.0248 72.2753 15.3451 8.1980 28.9477 11.8597 10.2996
temp: 298.150 k
press: 1.00000 atm
elementType: 14 8 8 6 6 6 6 6 6 6 1 1 1 1 1 1 1 1 1 1 1 1 1 1 1 1
symmnumber: 1
zpe: 577611.1 jmol-1
zpe.correction: 0.220000 hartree
zpe.thermalcorrener: 0.233385 hartree
zpe.thermalcorrenthalpy: 0.234329 hartree
zpe.thermalcorrgfe: 0.181337 hartree
zpe.sumelectzpe: -715.409581 hartree
zpe.sumelectthermal: -715.396197 hartree
zpe.sumelectthermalent: -715.395252 hartree
zpe.sumelectthermalfe: -715.448244 hartree
dipole: -0.6778 -1.2371 0.0000
dipole: 1.4106
quadrupole: -62.4353 -68.9414 -75.6650
quadrupole: 0.5936 -0.0001 0.0000
quadrupole: 6.5786 0.0725 -6.6511 0.5936 -0.0001 0.0000
hfenergy: -715.6295811 hartree
pointgroup: C01 [X(C7H16O2Si1)]
dipole: 0.274123 0.4825646 -0.0000967 debye
dipolederiv: 2.2351404 0.0413826 -0.0000179 -0.1653044 1.5526285 -0.0000501 0.0000288 -0.0000544 1.3318907 -1.4748342 -0.0844583 -0.1283779 -0.0796897 -0.6090828 -0.0651448 -0.1519251 -0.0444601 -0.6858786 -1.4748 -0.0844032 0.1284235 -0.079637 -0.6090427 0.0651188 0.1519562 0.0444314 -0.6859176 -0.094074 -0.0248302 0.0000016 -0.0408035 0.0558109 -0.0000208 0.000011 -0.0000209 -0.0568713 0.8641978 0.0695885 0.1106698 0.2014984 0.3078198 0.0976823 -0.1032287 0.0085585 0.259143 0.8641668 0.0695457 -0.110699 0.2015424 0.3077772 -0.0977079 0.1031449 -0.0085785 0.2591752 -0.0550781 -0.0463172 0.0000105 0.014318 0.0384106 0.0000036 -0.000001 0.000005 0.0605361 0.0197274 -0.014479 0.000002 -0.03426 -0.0823927 0.0000267 0.0000042 0.0000275 0.0626013 -0.4431784 0.0566939 -0.0000111 0.1127467 -0.5404415 0.0000625 -0.0000204 0.0000657 -0.2541245 -0.4289117 -0.0695315 0.0000191 -0.1019645 -0.4689364 0.0000578 0.0000295 0.0000588 -0.2189485 -0.0773676 0.0103347 -0.1236155 0.0300177 0.0610121 0.0740514 -0.1001601 0.0305488 -0.0909159 -0.0338293 -0.0029559 0.0043935 -0.0657041 -0.2337734 -0.0596106 0.0467026 0.0253206 0.0618736 -0.0338239 -0.0029451 -0.0043952 -0.0657049 -0.2337612 0.0597169 -0.0466772 -0.0252152 0.0618629 -0.0773593 0.0103733 0.1236126 0.030047 0.0609776 -0.0741003 0.1001472 -0.0305994 -0.0908828 0.0802934 0.0509559 -0.0000099 -0.0230275 -0.1875236 0.0000567 0.0000057 0.0000552 0.0930282 -0.0072336 0.0101813 -0.0790708 0.0359408 0.0723807 0.0707192 -0.1522153 0.0455311 -0.0751984 -0.0072271 0.010212 0.0790639 0.0360001 0.0723339 -0.0707798 0.1521984 -0.0455909 -0.0751579 0.0140763 0.0636847 0.1007198 0.0328739 0.0448867 -0.0325041 0.1325569 -0.0872246 -0.0844172 0.014079 0.063645 -0.1007416 0.0328247 0.0449308 0.0324559 -0.1325685 0.087177 -0.0844625 -0.0676654 -0.1290079 0.0000251 -0.1018493 0.0339766 0.0000121 0.0000213 0.00001 0.0937636 0.0039869 0.0263686 0.1103337 0.0498099 0.1085262 -0.0386058 0.1125295 -0.0307444 -0.0272396 0.0512595 -0.1142282 0.0000276 -0.1523344 -0.0562478 0.0000399 0.0000356 0.0000401 0.1039871 0.0039768 0.0263193 -0.1103475 0.0497597 0.1085575 0.0385413 -0.1125541 0.0306799 -0.0272629 0.0111627 -0.0038313 -0.1098801 -0.0172323 0.1161689 -0.0043266 -0.1153446 -0.0085041 -0.0203783 0.1021431 0.071484 -0.0000159 0.1173129 -0.0811706 0.0000404 -0.000027 0.0000407 0.1101878 0.0111726 -0.0037816 0.1098795 -0.0171804 0.1161748 0.0042654 0.1153498 0.0084421 -0.0203934 unknown
polarizability: 119.3191894|1.3271187|97.72517|-0.000647|-0.0025055|86.7017039 unknown
InChI: InChI=1S/C7H16O2Si/c1-7(2)5-8-10(3,4)9-6-7/h5-6H2,1-4H3
charge 0 multiplicity 1
26 atoms
Si -1.613406 0.064977 0.000004
O  -0.548265 -0.082509 1.379181
O  -0.548301 -0.083101 -1.379143
C  1.580318 -0.007927 -0.000026
C  0.814664 0.46242 1.275312
C  0.814609 0.461931 -1.275511
C  2.97201 0.671933 -0.000183
C  1.731797 -1.547399 0.000263
C  -2.470696 1.759698 -0.000359
C  -2.792294 -1.402301 0.000349
H  1.345032 0.122094 2.183063
H  0.77726 1.575672 1.290617
H  0.777151 1.575176 -1.291211
H  1.344963 0.121305 -2.183156
H  2.887913 1.776037 -0.000403
H  3.553725 0.375076 0.892435
H  3.5537 0.374715 -0.892696
H  2.285088 -1.88559 -0.895895
H  2.285078 -1.885258 0.896552
H  0.746477 -2.042618 0.000347
H  -3.108073 1.875333 0.895016
H  -1.733664 2.583065 -0.000566
H  -3.108113 1.87492 -0.89576
H  -3.438961 -1.388885 -0.894816
H  -2.221488 -2.34618 0.00055
H  -3.438923 -1.388484 0.895537
