program: Gaussian 09
title: 000084659
version: EM64L-G09RevD.01
frameworkgroup: C1[X(C17H12O2S)]
method: RPBEPBE
basis: SDD
operation: Freq
keyword: #p
keyword: freq=noraman
keyword: PBEPBE/SDD
title: #p freq=noraman PBEPBE/SDD
converged: YES YES NO NO
title: Mulliken charges:
elementType: S O O C C C C C C C C C C C C C C C C C H H H H H H H H H H H H
charge: -0.014534 -0.405918 -0.212546 0.394838 0.423981 -0.585529 0.387800 -0.457408 -0.359106 -0.372834 -0.418194 -0.248374 -0.239220 0.143224 0.472300 -0.324448 -0.400935 -0.205197 -0.194344 -0.239879 0.243216 0.274008 0.253442 0.243981 0.232723 0.233002 0.154451 0.264011 0.258386 0.232744 0.233012 0.233348
chargesum: 0.00000
title: Mulliken charges with hydrogens summed into heavy atoms:
elementType: S O O C C C C C C C C C C C C C C C C C
charge: 0.139917 -0.405918 -0.212546 0.394838 0.423981 -0.585529 0.387800 -0.214193 -0.085098 -0.119393 -0.174213 -0.015651 -0.006217 0.143224 0.472300 -0.060437 -0.142549 0.027547 0.038668 -0.006530
polarizability: 3.60922571e+02 -7.97665131e+00 2.03829421e+02 1.23609324e+00 -6.80729898e+00 1.03799225e+02
1716.lowfreq: -9.7664 -4.4450 -1.1421 -0.0018 -0.0014 -0.0002 21.0493 24.5105 47.1584
frequency: 21.0091 24.4529 47.1435 66.1821 74.4685 110.7783 162.8273 209.0384 213.1265 244.3058 266.8429 285.2398 357.3547 374.7062 391.5303 408.5783 412.0968 454.1524 457.8776 487.5153 495.3100 525.5954 556.0873 577.6489 604.6959 609.5305 632.2722 669.5918 689.7316 714.7854 733.2261 766.3817 771.9977 791.6283 805.6694 807.5176 834.9959 842.3812 845.5652 894.0710 916.6828 945.8371 957.3537 965.9321 969.9808 989.0997 993.0294 993.4549 1000.5835 1019.7504 1025.7507 1042.1762 1078.3485 1136.8566 1150.4160 1171.7889 1175.6166 1179.1516 1182.5823 1216.2885 1236.8332 1275.9559 1309.4395 1312.6320 1385.6752 1396.1519 1404.0648 1424.1217 1441.4953 1447.7480 1472.2866 1503.1510 1553.5401 1597.0045 1605.5004 1608.1858 1624.0284 1632.9142 2253.6951 3126.4507 3135.4190 3137.9132 3139.5540 3146.5345 3153.2393 3161.1035 3168.0852 3170.0267 3172.7250 3184.3548
redmass: 5.7272 4.7511 7.1746 7.1377 6.4655 4.6210 6.2157 5.7580 4.7090 7.1959 5.6617 7.0186 8.4490 5.6686 9.6520 2.8172 2.8132 1.2820 3.6142 3.8146 3.6194 7.0873 3.1468 6.7711 6.9432 6.4852 5.1634 6.4145 2.3285 3.2016 2.2852 1.4754 3.8696 3.3763 2.6511 4.2450 1.2565 1.5158 3.5800 1.8487 1.4519 5.1297 1.7639 1.3775 1.3812 4.7490 1.3947 1.3380 1.3600 2.3843 3.3671 2.5096 1.5106 2.0623 2.3819 1.0768 1.2340 1.1718 1.3046 2.9885 1.8551 1.7034 1.3296 2.9162 10.1279 6.4190 2.3168 4.5887 2.2305 2.1727 2.2567 3.3286 7.3492 6.3181 6.7432 6.4127 7.5636 9.5127 1.0395 1.0863 1.0854 1.0891 1.0886 1.0898 1.0945 1.0943 1.1002 1.0961 1.0985 1.0981
irintensity: 0.9773 0.3802 0.6776 0.5518 0.7633 0.1643 0.7230 2.2879 3.5934 7.4666 1.0532 2.4103 6.9413 1.7960 3.6368 1.1595 16.0233 29.6652 18.6943 4.7441 4.4085 0.6255 6.9000 0.0212 5.6952 2.0082 1.3486 4.5510 25.4636 3.8864 39.0921 66.9845 11.8127 33.3799 1.2264 24.6603 2.3488 55.0256 42.9486 9.2807 6.2291 53.2501 161.3730 3.8366 2.2582 4.4716 0.7387 0.1259 0.2544 4.0328 204.2877 142.4755 12.7732 80.1461 274.3515 6.8055 7.7997 2.8519 84.4126 93.9021 14.4831 30.8315 3.0018 149.0306 1.9776 2.4544 1.2026 23.5371 9.1658 52.9720 79.7740 10.5910 10.5062 22.8754 62.6995 18.2065 205.3498 151.6942 386.1111 1.0645 0.3029 0.4125 15.6677 11.9898 22.8361 31.6103 24.2667 11.8181 12.2153 1.4959
temp: 298.150 k
press: 1.00000 atm
elementType: 16 8 8 6 6 6 6 6 6 6 6 6 6 6 6 6 6 6 6 6 1 1 1 1 1 1 1 1 1 1 1 1
symmnumber: 1
zpe: 619237.5 jmol-1
zpe.correction: 0.235855 hartree
zpe.thermalcorrener: 0.252190 hartree
zpe.thermalcorrenthalpy: 0.253134 hartree
zpe.thermalcorrgfe: 0.189756 hartree
zpe.sumelectzpe: -1202.158190 hartree
zpe.sumelectthermal: -1202.141855 hartree
zpe.sumelectthermalent: -1202.140911 hartree
zpe.sumelectthermalfe: -1202.204290 hartree
dipole: 0.1322 -0.7340 -0.0471
dipole: 0.7473
quadrupole: -90.7586 -121.8646 -124.5728
quadrupole: 6.7810 1.4074 -3.9683
quadrupole: 21.6400 -9.4659 -12.1741 6.7810 1.4074 -3.9683
hfenergy: -1202.3940452 hartree
pointgroup: C01 [X(C17H12O2S1)]
dipole: -0.0529877 -0.2073445 -0.2016255 debye
polarizability: 360.6098028|-1.8139701|142.5388481|11.8770634|49.0169896|165.4025661 unknown
InChI: InChI=1S/C17H12O2S/c18-17(19-13-7-2-1-3-8-13)15-11-10-12-6-4-5-9-14(12)16(15)20/h1-11,20H
charge 0 multiplicity 1
32 atoms
S  -0.553495 -1.636326 -1.462818
O  1.691624 -0.182968 -0.262365
O  1.495933 1.444592 1.398576
C  -2.735761 -0.265906 -0.429278
C  -3.420842 0.719646 0.380505
C  -1.282029 -0.337389 -0.408045
C  -0.550868 0.567081 0.413607
C  -2.65303 1.613265 1.198319
C  -1.273173 1.533266 1.210707
C  -3.531639 -1.146163 -1.235558
C  -4.850612 0.786086 0.352387
C  -4.926412 -1.060664 -1.244857
C  -5.595915 -0.085972 -0.444223
C  0.922672 0.677676 0.596555
C  3.126963 -0.202039 -0.194748
C  3.80206 -0.447091 1.018046
C  3.810891 -0.06022 -1.41784
C  5.210972 -0.546906 0.994278
C  5.21996 -0.170811 -1.425562
C  5.921606 -0.412542 -0.221811
H  -3.171159 2.358561 1.811362
H  -0.672739 2.206119 1.829735
H  -3.039272 -1.899371 -1.858389
H  -5.352068 1.538741 0.971922
H  -5.509935 -1.744659 -1.870151
H  -6.689559 -0.025774 -0.458065
H  0.759175 -1.279985 -1.137259
H  3.245435 -0.54182 1.953548
H  3.248257 0.134915 -2.335827
H  5.751715 -0.730805 1.928727
H  5.764533 -0.065068 -2.369808
H  7.013611 -0.494469 -0.230472
