program: Gaussian 09
title: 000084607
version: EM64L-G09RevD.01
frameworkgroup: C1[X(C8H19N2O2)]
method: RPBEPBE
basis: SDD
operation: Freq
keyword: #p
keyword: freq=noraman
keyword: PBEPBE/SDD
title: #p freq=noraman PBEPBE/SDD
converged: YES YES NO NO
title: Mulliken charges:
elementType: O O N N C C C C C C C C H H H H H H H H H H H H H H H H H H H
charge: -0.324798 -0.287839 -0.112990 -0.138326 -0.358574 -0.550545 -0.534924 -0.549562 -0.268219 0.343860 -0.603444 -0.615064 0.278041 0.277905 0.272615 0.263631 0.277274 0.270561 0.265975 0.270625 0.272144 0.277063 0.263705 0.250527 0.249773 0.278992 0.242063 0.242104 0.243430 0.260503 0.243492
chargesum: 1.00000
title: Mulliken charges with hydrogens summed into heavy atoms:
elementType: O O N N C C C C C C C C
charge: -0.324798 -0.287839 -0.112990 -0.138326 0.197372 0.262975 0.272237 0.263351 0.232081 0.343860 0.159715 0.132361
polarizability: 1.39304807e+02 -5.16681518e+00 1.00502055e+02 4.73722057e-02 4.07526630e-03 8.23022511e+01
1716.lowfreq: -19.0699 -1.3036 0.0001 0.0006 0.0008 6.8112 10.4774 27.4111 63.8948
frequency: -11.7366 27.2012 63.2496 78.8178 84.0881 109.7370 112.0880 142.5046 190.0454 193.2985 228.8056 250.9580 255.3745 262.8414 314.6447 343.8238 366.6453 384.7732 432.1412 448.8445 473.5516 555.4614 589.8603 677.5700 721.1900 782.0386 801.7483 887.3418 921.4632 928.8021 948.2902 1023.0351 1045.1240 1055.5607 1057.3414 1073.9016 1096.5645 1118.6433 1123.4215 1137.3624 1148.3930 1190.2062 1216.6344 1235.5553 1251.5310 1253.2780 1303.0693 1328.4342 1368.0367 1395.8073 1423.7855 1424.9186 1428.4489 1441.5654 1447.3383 1453.2009 1460.2077 1463.5963 1472.8203 1473.4234 1474.2342 1485.0976 1485.5096 1486.6675 1491.3931 1498.0938 1500.5036 1694.0840 2984.3891 2989.7412 3007.4506 3025.8141 3028.4101 3031.4442 3035.5263 3059.3721 3065.7498 3070.3447 3112.5097 3135.3672 3142.3619 3143.2282 3147.5755 3149.1346 3152.5716 3153.9980 3157.6590
redmass: 2.8466 3.0652 1.6117 3.8405 1.0798 1.2765 2.4210 3.2338 3.5577 1.3240 2.4608 1.2357 1.1379 2.6395 3.4697 2.2157 3.0185 2.6752 2.2738 3.0159 2.8825 4.0273 5.5575 11.4615 4.9913 5.9187 1.1662 3.3291 2.6969 3.9119 3.0114 5.7207 1.1969 1.2832 1.4071 2.0667 1.2196 1.7606 2.0790 1.4301 1.3713 1.2990 1.8027 5.6369 1.3100 1.9370 1.3148 1.3436 2.2923 1.5327 1.1556 1.1434 1.1575 1.1929 1.0948 1.0459 1.0987 1.0405 1.0777 1.0507 1.0406 1.0427 1.0605 1.0520 1.0670 1.1561 1.0685 8.6068 1.0374 1.0362 1.0568 1.0323 1.0323 1.0368 1.0548 1.1021 1.1075 1.1026 1.1085 1.0991 1.1056 1.1060 1.1051 1.1054 1.0964 1.1057 1.1050
irintensity: 1.0210 1.3310 0.2486 3.4653 0.3970 3.1773 5.2700 3.8570 2.6509 0.8003 5.1950 1.9054 0.6871 2.5735 4.5180 0.0454 18.8316 2.3643 0.0090 8.4302 4.5957 2.7685 6.5025 16.9373 10.3504 38.1545 4.1123 101.2891 14.9832 26.5176 14.8686 122.2564 0.0281 0.0025 16.9495 12.8332 0.0166 85.6458 278.8742 0.0429 0.0009 0.4571 1.6607 27.7578 0.6876 0.0932 1.8393 1.8487 99.7793 30.0534 20.0346 21.6151 17.9499 13.0133 1.1724 1.0910 5.5342 1.3029 3.4895 14.9526 0.0040 33.5946 63.8837 48.4506 8.3382 35.0288 66.2260 424.9514 28.0737 66.4058 30.4087 2.0110 2.1310 4.0745 3.6706 25.6471 12.7551 21.7221 6.8027 1.2918 0.6723 0.4908 2.6405 9.4817 5.7137 1.4978 5.2594
temp: 298.150 k
press: 1.00000 atm
elementType: 8 8 7 7 6 6 6 6 6 6 6 6 1 1 1 1 1 1 1 1 1 1 1 1 1 1 1 1 1 1 1
symmnumber: 1
zpe: 718935.5 jmol-1
zpe.correction: 0.273828 hartree
zpe.thermalcorrener: 0.288717 hartree
zpe.thermalcorrenthalpy: 0.289661 hartree
zpe.thermalcorrgfe: 0.231469 hartree
zpe.sumelectzpe: -574.945477 hartree
zpe.sumelectthermal: -574.930588 hartree
zpe.sumelectthermalent: -574.929644 hartree
zpe.sumelectthermalfe: -574.987836 hartree
dipole: 10.4346 2.8258 -0.0070
dipole: 10.8104
quadrupole: -5.0111 -69.8566 -66.1379
quadrupole: -6.0870 0.0000 -0.0015
quadrupole: 41.9908 -22.8548 -19.1360 -6.0870 0.0000 -0.0015
hfenergy: -575.2193049 hartree
pointgroup: C01 [X(C8H19N2O2)]
dipole: -4.1279389 -1.0244237 -0.0034448 debye
polarizability: 139.0680469|-5.9852047|100.7380528|0.0785999|-0.119626|82.3030128 unknown
InChI: InChI=1S/C8H19N2O2/c1-9(2)8(11)12-7-6-10(3,4)5/h6-7H2,1-5H3
charge 1 multiplicity 1
31 atoms
O  0.799679 -0.391479 0.005577
O  1.915301 1.676305 -0.008476
N  -2.962462 -0.035603 -0.007828
N  3.131302 -0.344231 0.004122
C  -1.528019 -0.615728 0.001302
C  -3.198213 0.815503 -1.257131
C  -3.940668 -1.21304 -0.018991
C  -3.217382 0.80787 1.242838
C  -0.412176 0.43852 0.003007
C  2.002309 0.420597 -0.000256
C  4.444396 0.33458 -0.001581
C  3.146485 -1.818749 0.014491
H  -1.445127 -1.250345 0.899985
H  -1.435959 -1.255216 -0.893024
H  -2.94589 0.220842 -2.148282
H  -4.258475 1.109703 -1.290488
H  -2.568298 1.715252 -1.217257
H  -3.773531 -1.827031 0.878803
H  -4.970763 -0.825585 -0.021211
H  -3.765677 -1.816392 -0.922497
H  -2.989798 0.203945 2.134449
H  -2.578689 1.70206 1.223728
H  -4.275443 1.111504 1.255872
H  -0.419444 1.085651 -0.8927
H  -0.422568 1.08634 0.898208
H  4.291417 1.423273 -0.008983
H  5.019652 0.041724 -0.89878
H  5.021025 0.054167 0.898706
H  3.675675 -2.197008 -0.879829
H  2.122351 -2.212151 0.017867
H  3.676691 -2.184379 0.91346
