program: Gaussian 09
title: 000084689
version: EM64L-G09RevD.01
frameworkgroup: C1[X(C16H32N2)]
method: RPBEPBE
basis: SDD
operation: Freq
keyword: #pfreq=noraman
keyword: PBEPBE/SDD
title: #p freq=noraman PBEPBE/SDD
converged: YES YES NO NO
title: Mulliken charges:
elementType: N N C C C C C C C C C C C C C C C C H H H H H H H H H H H H H H H H H H H H H H H H H H H H H H H H
charge: -0.067696 -0.067824 -0.136263 -0.177155 -0.136229 -0.177123 0.227109 0.227362 -0.441094 -0.441370 -0.724103 -0.716469 -0.712572 -0.703960 -0.724031 -0.716685 -0.713150 -0.703714 0.193179 0.217126 0.193169 0.217215 0.191537 0.207488 0.191347 0.207371 0.215189 0.239605 0.209140 0.208822 0.211658 0.233766 0.245646 0.209076 0.215043 0.223406 0.214496 0.217290 0.214846 0.239832 0.208934 0.208991 0.211976 0.233572 0.245979 0.209058 0.215008 0.223463 0.214448 0.217296
chargesum: 0.00000
title: Mulliken charges with hydrogens summed into heavy atoms:
elementType: N N C C C C C C C C C C C C C C C C
charge: -0.067696 -0.067824 0.056916 0.039971 0.056940 0.040091 0.227109 0.227362 -0.042069 -0.042652 -0.060169 -0.062224 -0.042807 -0.048769 -0.060418 -0.062147 -0.043106 -0.048507
polarizability: 2.13550943e+02 5.19224999e+00 1.79434456e+02 2.26514715e-03 -4.54731749e-02 1.77353492e+02
1716.lowfreq: -11.3864 -8.0183 -0.0006 0.0003 0.0005 8.8169 12.1616 28.7841 30.6182
frequency: 10.9247 28.1819 30.2624 33.3742 48.6489 64.0948 66.3354 107.6877 108.0710 145.4343 180.3785 191.2364 198.7030 201.3368 206.1552 214.4166 215.5910 222.6090 234.6573 238.2544 242.6450 254.2646 256.0382 275.8506 288.5085 292.5653 303.4365 348.6888 351.1130 371.7721 406.4559 409.1284 471.5669 529.8404 547.3561 555.2415 568.1638 664.3920 693.7706 705.9570 706.5643 847.1722 863.5458 865.2781 886.6181 908.9981 915.4022 917.0414 917.5041 919.9491 920.0591 957.0844 957.3665 960.6548 960.8251 986.8389 988.6263 996.4850 1033.3352 1077.9440 1091.0134 1093.0278 1106.7901 1107.3593 1122.5514 1122.7031 1157.8555 1163.6982 1168.2595 1169.3464 1204.2213 1211.1563 1220.6280 1246.9344 1302.0454 1302.4169 1304.4704 1304.6326 1310.2527 1316.8197 1336.7206 1337.8922 1342.6897 1351.4811 1361.9699 1362.8919 1374.9351 1375.2314 1381.7243 1382.2995 1393.3364 1393.3885 1446.4211 1454.0303 1457.7045 1458.2450 1466.1134 1467.9827 1468.5021 1469.9286 1472.7452 1473.4767 1473.9737 1474.8867 1480.5692 1481.2521 1486.6671 1489.3061 1492.7485 1493.1677 1637.1820 1638.2845 2943.9399 2944.1756 2971.8671 2972.0995 2972.8979 2973.0201 2973.9718 2974.0660 2978.2652 2978.4778 2993.6576 2993.8255 3006.0235 3006.7148 3009.0648 3012.6198 3063.6066 3063.7359 3066.4197 3066.7258 3068.5764 3068.8030 3072.1839 3072.2783 3075.7202 3075.9802 3082.7249 3082.8366 3084.7532 3085.0459 3090.3621 3090.5885
redmass: 3.0111 2.7141 2.8816 3.1514 3.9260 3.0987 2.6552 3.1671 3.3319 2.7164 2.3497 2.2545 1.4500 1.0942 1.6744 1.0631 1.0731 2.2795 1.1850 1.2202 2.0541 1.1350 1.1596 2.3024 2.6205 2.6562 2.6415 2.2259 2.4848 3.7420 2.2773 2.5078 2.5903 2.8193 2.4762 2.9092 3.0707 2.7647 3.2247 5.2005 4.4271 2.5422 2.4042 2.4613 2.4221 2.2017 1.5415 1.2033 1.4775 1.1822 1.1876 1.3895 1.3869 1.4979 1.4993 1.6827 1.7691 2.1253 2.5027 2.2761 2.6095 2.6997 1.8452 1.8056 2.6809 2.6739 1.7908 1.9463 2.0139 2.0283 1.9620 2.3181 1.3194 1.1815 1.3288 1.3255 1.3185 1.3283 1.4375 1.4179 1.6083 1.6430 1.2568 1.1993 1.1948 1.1942 1.1907 1.1894 1.2191 1.2155 1.2000 1.1995 1.0909 1.1016 1.0462 1.0465 1.0494 1.0448 1.0509 1.0475 1.0497 1.0507 1.0489 1.0489 1.0454 1.0460 1.0523 1.0521 1.0597 1.0595 8.6913 8.7687 1.0568 1.0598 1.0344 1.0343 1.0348 1.0349 1.0361 1.0361 1.0353 1.0356 1.0820 1.0817 1.0901 1.0912 1.0882 1.0952 1.1004 1.1004 1.0998 1.0998 1.0994 1.0994 1.0989 1.0989 1.0999 1.0998 1.1003 1.1003 1.0995 1.0993 1.0995 1.0994
irintensity: 0.0292 0.0050 0.3505 2.1482 0.0860 2.0303 0.1328 2.0728 0.0434 0.5897 1.4830 0.5955 0.5167 0.3535 0.6478 0.0251 0.0088 0.8151 0.6353 0.3118 2.9996 0.4802 0.0420 0.0027 0.3475 0.3763 0.5304 3.8480 2.1270 0.1550 3.0962 0.8438 15.4926 0.0279 1.4390 1.5554 16.7285 1.0527 0.5371 0.0787 0.2936 0.6444 0.8352 1.4078 3.1108 5.5387 8.9836 1.8343 0.9474 2.5670 2.3065 0.0094 0.0583 0.4405 0.4549 0.8290 33.8321 64.0885 0.7680 0.2036 0.2064 0.5403 16.9065 29.5428 4.1330 2.8297 0.5779 0.1737 0.9035 0.0004 4.9833 3.5053 1.2644 0.0017 1.1609 1.4538 0.5903 0.0149 4.6487 1.4568 2.8111 0.0988 6.4092 5.7097 7.0052 19.2806 16.4956 15.7718 0.2658 36.7391 21.3560 5.7309 32.9669 0.4500 2.4295 2.2017 4.0883 1.3874 7.7989 2.6593 5.5978 1.0875 9.4846 0.3477 28.9915 7.5978 17.6693 0.1466 11.1657 44.5601 100.3256 54.1229 49.4128 54.2028 21.8107 36.9574 82.2891 16.3111 4.4312 55.1395 24.6481 35.2056 49.4723 17.2973 3.5701 45.9433 2.1413 53.5075 20.5430 11.5527 28.6226 1.3114 39.0964 134.4828 96.0911 1.7459 13.1209 63.4470 3.8301 4.0458 15.5723 50.4598 69.3748 52.1809
temp: 298.150 k
press: 1.00000 atm
elementType: 7 7 6 6 6 6 6 6 6 6 6 6 6 6 6 6 6 6 1 1 1 1 1 1 1 1 1 1 1 1 1 1 1 1 1 1 1 1 1 1 1 1 1 1 1 1 1 1 1 1
symmnumber: 1
zpe: 1178258.0 jmol-1
zpe.correction: 0.448775 hartree
zpe.thermalcorrener: 0.472917 hartree
zpe.thermalcorrenthalpy: 0.473861 hartree
zpe.thermalcorrgfe: 0.393604 hartree
zpe.sumelectzpe: -736.884279 hartree
zpe.sumelectthermal: -736.860136 hartree
zpe.sumelectthermalent: -736.859192 hartree
zpe.sumelectthermalfe: -736.939450 hartree
dipole: -0.0151 0.0038 -0.1780
dipole: 0.1787
quadrupole: -109.0522 -116.7188 -112.2846
quadrupole: 5.8510 -0.0080 -0.0027
quadrupole: 3.6330 -4.0336 0.4006 5.8510 -0.0080 -0.0027
hfenergy: -737.3330534 hartree
pointgroup: C01 [X(C16H32N2)]
dipole: -0.0057205 0.0700203 0.0024751 debye
polarizability: 214.3231895|0.040703|177.3534138|-0.1231969|0.043374|178.6622874 unknown
InChI: InChI=1S/C16H32N2/c1-11(2)15(12(3)4)17-9-10-18-16(13(5)6)14(7)8/h11-14H,9-10H2,1-8H3
charge 0 multiplicity 1
50 atoms
N  -1.300883 -1.138644 0.812075
N  1.307364 -1.13478 -0.823404
C  -2.657717 0.739671 1.50642
C  -2.9758 -0.266785 -0.903407
C  2.660735 0.751237 -1.502872
C  2.972007 -0.265684 0.903505
C  -2.237976 -0.305514 0.448426
C  2.240013 -0.300284 -0.451529
C  -0.770931 -2.21943 -0.037341
C  0.775947 -2.220768 0.01832
C  -3.254731 0.037664 2.753932
C  -1.454258 1.630144 1.906039
C  -2.755632 1.087482 -1.629203
C  -4.488917 -0.564626 -0.717831
C  3.253674 0.057599 -2.756742
C  1.457964 1.647122 -1.893123
C  2.751893 1.087042 1.632058
C  4.485213 -0.565935 0.72241
H  -3.439481 1.388807 1.066441
H  -2.562174 -1.058006 -1.556948
H  3.444562 1.395496 -1.059479
H  2.554261 -1.05766 1.553497
H  -1.072334 -2.188485 -1.105816
H  -1.124508 -3.179717 0.391162
H  1.077625 -2.198252 1.086917
H  1.127833 -3.178366 -0.417466
H  -4.151417 -0.556102 2.496349
H  -2.503032 -0.646249 3.185437
H  -3.542481 0.78197 3.520041
H  -1.754864 2.374662 2.666891
H  -1.043158 2.17148 1.033343
H  -0.654674 0.994054 2.324832
H  -1.680836 1.279023 -1.796222
H  -3.170933 1.933403 -1.050964
H  -3.261135 1.076117 -2.612981
H  -4.65097 -1.555525 -0.255896
H  -4.976189 0.194559 -0.0786
H  -5.000526 -0.554496 -1.698491
H  4.150713 -0.538445 -2.5056
H  2.500402 -0.622988 -3.190662
H  3.539853 0.806948 -3.518532
H  1.758493 2.397268 -2.64845
H  1.049022 2.181999 -1.015468
H  0.656736 1.015667 -2.315867
H  1.676859 1.28036 1.795257
H  3.171477 1.933703 1.058033
H  3.253309 1.071743 2.617878
H  4.646917 -1.55617 0.258937
H  4.975823 0.19369 0.086203
H  4.993763 -0.558699 1.704693
