program: Gaussian 09
title: 000084597
version: EM64L-G09RevD.01
frameworkgroup: C1[X(C9H20N2O)]
method: RPBEPBE
basis: SDD
operation: Freq
keyword: #p
keyword: freq=noraman
keyword: PBEPBE/SDD
title: #p freq=noraman PBEPBE/SDD
converged: YES YES NO NO
title: Mulliken charges:
elementType: O N N C C C C C C C C C H H H H H H H H H H H H H H H H H H H H
charge: -0.453192 -0.143756 -0.551443 0.318858 0.315753 -0.433328 -0.441556 -0.151968 -0.766952 -0.730841 -0.728260 -0.769425 0.184017 0.207367 0.202744 0.218085 0.215818 0.246285 0.218007 0.200598 0.214814 0.228921 0.212811 0.226350 0.217461 0.211896 0.245474 0.203750 0.216875 0.255254 0.251297 0.358288
chargesum: 0.00000
title: Mulliken charges with hydrogens summed into heavy atoms:
elementType: O N N C C C C C C C C C
charge: -0.094904 -0.143756 -0.044892 0.318858 0.315753 -0.041944 -0.020728 0.063850 -0.102062 -0.074296 -0.072553 -0.103326
polarizability: 1.20352950e+02 -9.90065863e-01 1.15511153e+02 -8.53413024e-01 1.34750778e+00 1.07553918e+02
1716.lowfreq: -15.3854 -0.0006 -0.0005 0.0009 3.9401 18.2980 110.1400 115.3118 122.5411
frequency: 110.1144 115.2342 122.5263 161.6501 195.9241 215.7909 229.0344 238.3481 252.4712 282.7005 287.2091 292.4771 304.7229 327.3535 346.9115 387.7109 407.3994 420.6604 438.3525 463.2280 481.5255 498.2042 519.7783 559.9837 661.9514 685.1787 787.5980 821.5247 848.4464 856.1437 868.2433 913.4126 928.6227 936.0776 939.5483 942.6657 985.6125 999.8995 1015.2494 1056.3443 1077.6767 1097.7162 1122.8084 1173.8861 1184.1063 1206.2536 1212.8499 1231.8231 1241.2888 1247.6147 1285.7914 1291.6013 1327.0530 1336.7690 1363.2393 1366.4074 1379.7337 1382.9725 1393.1796 1440.2554 1452.2150 1454.7249 1458.7646 1463.4647 1470.9280 1477.9039 1490.8236 1492.7504 1508.8467 1634.7947 2969.5790 2975.5554 2983.9003 2985.3846 2987.4300 2993.6169 2997.5561 3032.5376 3050.4282 3073.2377 3075.6380 3082.4475 3087.9173 3104.5231 3111.5917 3111.9009 3118.3608 3410.3996 3536.2800 3562.4685
redmass: 4.0297 1.0977 2.0937 2.6749 1.5344 1.0999 1.2547 1.2246 2.2836 1.9730 1.7234 2.8883 2.1295 1.1853 2.6370 2.5591 3.0282 2.5750 2.5739 2.3228 2.9557 2.3943 4.1249 2.7763 1.4497 3.5503 2.9967 4.5900 3.2134 1.6752 2.7666 2.4154 1.8244 1.5891 1.3963 1.8103 1.5463 1.3793 1.3817 1.8193 1.3004 2.5734 1.8142 2.3783 2.3712 1.6374 1.9626 2.7956 2.3847 1.7479 1.5393 1.4610 1.3816 1.4228 1.2081 1.2689 1.3965 1.2043 1.1948 1.0799 1.0662 1.0607 1.0501 1.0738 1.0557 1.0529 1.0553 1.0509 1.0503 1.0922 1.0586 1.0666 1.0372 1.0404 1.0738 1.0368 1.0379 1.1019 1.1003 1.0992 1.0992 1.0989 1.0973 1.0998 1.0980 1.0979 1.0965 1.0445 1.0960 1.0679
irintensity: 0.4488 0.1886 1.1316 0.2923 0.4580 2.8087 1.5476 39.5849 4.2555 17.0530 0.1446 1.6335 1.0289 122.5814 3.5742 0.9175 1.2676 6.6107 0.3650 4.5147 2.8594 2.3602 9.4079 2.2691 238.8554 13.7564 1.2368 14.0642 19.4162 4.4941 2.2747 1.4956 0.8262 0.8343 1.5777 1.7081 0.3148 0.4274 3.8424 6.2763 8.6065 1.1531 2.5623 30.2660 19.5850 47.6635 33.9438 12.8613 16.2842 14.1422 6.2853 11.1769 8.2011 11.6877 5.6236 26.9888 9.7541 30.1073 24.0085 4.2506 0.9964 4.0209 7.5824 20.3279 0.2369 4.8155 0.2539 16.2395 16.1796 35.4383 35.9135 11.5264 36.2971 24.3049 34.5533 24.4765 38.8747 34.2899 32.0937 11.5458 21.0055 69.9167 31.6296 9.0750 7.7072 38.3548 46.4484 3.6008 0.2137 16.2923
temp: 298.150 k
press: 1.00000 atm
elementType: 8 7 7 6 6 6 6 6 6 6 6 6 1 1 1 1 1 1 1 1 1 1 1 1 1 1 1 1 1 1 1 1
symmnumber: 1
zpe: 744225.7 jmol-1
zpe.correction: 0.283461 hartree
zpe.thermalcorrener: 0.297708 hartree
zpe.thermalcorrenthalpy: 0.298653 hartree
zpe.thermalcorrgfe: 0.245361 hartree
zpe.sumelectzpe: -538.618705 hartree
zpe.sumelectthermal: -538.604457 hartree
zpe.sumelectthermalent: -538.603513 hartree
zpe.sumelectthermalfe: -538.656805 hartree
dipole: -1.1112 -0.5967 0.1223
dipole: 1.2672
quadrupole: -74.9419 -75.8368 -74.7248
quadrupole: -5.1549 -0.3809 0.3364
quadrupole: 0.2259 -0.6690 0.4430 -5.1549 -0.3809 0.3364
hfenergy: -538.9021659 hartree
pointgroup: C01 [X(C9H20N2O1)]
dipole: 0.4241439 -0.2563014 -0.0543617 debye
polarizability: 120.4309425|0.7412316|115.4579607|-0.9875789|-1.1915738|107.5291165 unknown
InChI: InChI=1S/C9H20N2O/c1-8(2)5-7(10)6-9(3,4)11(8)12/h7,12H,5-6,10H2,1-4H3
charge 0 multiplicity 1
32 atoms
O  -0.022374 -1.287057 1.680158
N  -0.02475 -1.204888 0.148011
N  0.037399 3.16904 0.423865
C  1.303097 -0.508605 -0.186239
C  -1.303951 -0.416958 -0.179239
C  1.309975 0.965794 0.320864
C  -1.219627 1.053632 0.324484
C  0.064817 1.78665 -0.116725
C  2.435937 -1.312866 0.499524
C  1.554671 -0.593156 -1.718001
C  -1.569181 -0.488066 -1.709228
C  -2.483997 -1.143401 0.513943
H  2.233167 1.468623 -0.032748
H  1.340104 0.952199 1.428992
H  -1.252601 1.041298 1.433369
H  -2.099038 1.623501 -0.029067
H  0.063448 1.888346 -1.220059
H  2.341318 -1.278781 1.595755
H  2.412539 -2.368766 0.170841
H  3.415297 -0.885092 0.217388
H  2.631266 -0.434945 -1.910214
H  1.281538 -1.593894 -2.095912
H  1.004997 0.162783 -2.298767
H  -1.362379 -1.504836 -2.086337
H  -2.634273 -0.260819 -1.8946
H  -0.977308 0.231988 -2.294231
H  -2.379944 -1.116763 1.609543
H  -3.433269 -0.648866 0.239182
H  -2.534979 -2.197854 0.184246
H  0.837477 3.736951 0.117218
H  -0.043386 3.183072 1.449287
H  -0.061889 -2.268264 1.8175
