program: Gaussian 09
title: 000084565
version: EM64L-G09RevD.01
frameworkgroup: C1[X(C4H5ClN4)]
method: RPBEPBE
basis: SDD
operation: Freq
keyword: #p
keyword: freq=noraman
keyword: PBEPBE/SDD
title: #p freq=noraman PBEPBE/SDD
converged: NO YES NO NO
title: Mulliken charges:
elementType: Cl N N N N C C C C H H H H H
charge: -0.016599 0.023453 -0.675257 -0.635890 0.063142 0.249689 0.156301 -0.348830 -0.325195 0.239405 0.303675 0.308816 0.337947 0.319342
chargesum: 0.00000
title: Mulliken charges with hydrogens summed into heavy atoms:
elementType: Cl N N N N C C C C
charge: -0.016599 0.023453 -0.062766 0.021400 0.063142 0.249689 0.156301 -0.109425 -0.325195
polarizability: 1.26454536e+02 2.25252098e+00 8.50078659e+01 2.56832953e-02 1.35342989e+00 3.36507799e+01
1716.lowfreq: -6.9894 -0.0008 0.0020 0.0022 4.2922 9.3924 100.1280 203.7924 238.4002
frequency: 100.1240 203.7924 238.3999 257.7858 277.1521 360.0904 374.8638 429.3518 471.2895 496.1327 538.9936 548.4838 586.4887 646.0753 654.0308 756.1059 766.9302 880.1467 893.5104 1008.9457 1055.7235 1162.4048 1259.9558 1301.2850 1336.9335 1348.0480 1454.6655 1541.2215 1563.3139 1620.1087 1644.6679 3128.8984 3511.3115 3523.6556 3644.6909 3671.5028
redmass: 6.3735 6.1262 3.6409 1.9743 1.9024 3.6287 13.0872 3.0543 3.3443 1.1254 1.9644 2.1513 1.3616 6.2452 9.3980 6.0822 7.4235 1.7484 3.4852 2.1553 1.4948 3.8986 2.7610 5.5658 2.6113 3.0433 5.7799 3.7983 5.7376 1.4378 1.1379 1.0925 1.0456 1.0448 1.1010 1.1036
irintensity: 1.9261 3.5176 7.2230 12.4987 6.7907 15.9768 10.9219 28.7409 2.3867 165.1024 144.9979 97.8344 241.6931 17.8136 15.1237 0.7857 9.4969 20.0952 28.9956 55.7253 22.5048 68.7335 31.6879 113.1149 100.9232 20.5061 204.7691 149.6888 44.1655 267.0201 98.3323 26.9586 25.9414 68.7105 24.3698 37.6702
temp: 298.150 k
press: 1.00000 atm
elementType: 17 7 7 7 7 6 6 6 6 1 1 1 1 1
symmnumber: 1
zpe: 258734.8 jmol-1
zpe.correction: 0.098547 hartree
zpe.thermalcorrener: 0.106802 hartree
zpe.thermalcorrenthalpy: 0.107746 hartree
zpe.thermalcorrgfe: 0.065537 hartree
zpe.sumelectzpe: -833.832993 hartree
zpe.sumelectthermal: -833.824738 hartree
zpe.sumelectthermalent: -833.823794 hartree
zpe.sumelectthermalfe: -833.866003 hartree
dipole: 7.5989 0.7537 0.2539
dipole: 7.6404
quadrupole: -49.6063 -53.2758 -61.2369
quadrupole: -1.0438 1.4263 -1.2179
quadrupole: 5.1000 1.4305 -6.5306 -1.0438 1.4263 -1.2179
hfenergy: -833.9315403 hartree
pointgroup: C01 [X(C4H5Cl1N4)]
dipole: -3.0044886 -0.0376153 -0.0867852 debye
dipolederiv: -0.9155531 0.1624296 -0.0769571 0.2194905 -0.1618957 0.0226677 -0.0809584 0.0265234 -0.0939083 -0.9018459 -0.2640628 -0.0442648 -0.1806334 -0.5252859 0.0123646 -0.062102 -0.0349431 -0.184669 -1.2984816 0.2441866 -0.1890005 0.1491195 -0.2184874 -0.2021883 -0.3235162 -0.0943794 -0.573804 -0.7732154 -0.6288781 0.1595057 -0.6060301 -0.8829404 -0.0525544 0.243854 0.0941209 -0.6395118 -0.8320079 -0.1679696 -0.0288663 0.5126845 -0.5950922 0.0667173 -0.1001691 0.0714786 -0.1650376 1.0638432 -0.3182013 0.0943088 -0.6110175 -0.4890167 0.0756976 0.0612468 0.0815308 0.1146879 0.7154332 0.6000068 -0.0218307 0.9757898 1.075653 0.0220604 -0.089108 0.0334423 0.1571385 0.3137713 0.3147483 -0.0107395 -0.245942 0.4422628 -0.0582694 0.1231927 -0.0728165 -0.1110396 1.7462117 -0.1102846 0.1520759 -0.4679742 0.7079733 -0.0993302 0.1910584 -0.0982605 0.0281661 0.033862 0.0919313 -0.0119124 0.0980902 -0.0771681 0.0162161 -0.0208192 0.0147343 0.1380049 0.2310312 0.0087445 0.0408074 0.0703036 0.1631285 0.1087517 0.1897424 0.063548 0.2836196 0.1920204 -0.0331275 0.0415994 -0.0008309 0.1153136 0.0535212 0.0555755 0.0058075 0.3513478 0.1844859 0.0325111 -0.0405194 0.0416144 0.2477666 -0.0045077 -0.0512234 -0.0459208 0.3648533 0.2404451 0.0679657 -0.0642064 0.0453357 0.1977886 0.0388534 -0.1367736 -0.0448658 0.3301522 unknown
polarizability: 126.1805792|-0.9830281|84.5761888|5.7455678|-4.4880495|34.3564134 unknown
InChI: InChI=1S/C4H5ClN4/c5-4-8-1-2(6)3(7)9-4/h1H,6-7H2
charge 0 multiplicity 1
14 atoms
Cl 3.145956 -0.487054 0.310616
N  0.522147 -1.076381 0.151953
N  -2.611921 0.904536 -0.130839
N  -1.716067 -1.797291 0.026666
N  1.119044 1.265947 -0.019375
C  -1.240167 0.609034 -0.051844
C  -0.799528 -0.760439 0.038012
C  -0.216937 1.578389 -0.099983
C  1.391422 -0.04144 0.131216
H  -0.456058 2.643841 -0.200923
H  -3.259512 0.36282 0.442685
H  -2.883266 1.87116 -0.305908
H  -1.345407 -2.744894 0.09272
H  -2.638505 -1.656929 -0.382196
