program: Gaussian 09
title: 000084624
version: EM64L-G09RevD.01
frameworkgroup: C1[X(C11H21N3O4)]
method: RPBEPBE
basis: SDD
operation: Freq
keyword: #p
keyword: freq=noraman
keyword: PBEPBE/SDD
title: #p freq=noraman PBEPBE/SDD
converged: YES YES NO NO
title: Mulliken charges:
elementType: O O O O N N N C C C C C C C C C C C H H H H H H H H H H H H H H H H H H H H H
charge: -0.268950 -0.246480 -0.279017 -0.323728 -0.354811 -0.555891 -0.344783 -0.390776 -0.350507 -0.367156 -0.254155 -0.382184 0.204449 0.238220 -0.519731 -0.530098 0.302313 -0.763395 0.215907 0.202377 0.209266 0.222243 0.202102 0.202054 0.251183 0.254729 0.213079 0.357349 0.274074 0.279005 0.257373 0.252119 0.316340 0.214979 0.241935 0.289493 0.218192 0.254005 0.258877
chargesum: 0.00000
title: Mulliken charges with hydrogens summed into heavy atoms:
elementType: O O O O N N N C C C C C C C C C C C
charge: -0.268950 -0.246480 -0.279017 -0.323728 0.002538 -0.002813 -0.028442 0.027507 0.081002 0.037000 -0.002972 0.085624 0.204449 0.238220 -0.010239 0.216309 0.302313 -0.032321
polarizability: 1.75317131e+02 -3.42411404e-02 1.59894654e+02 4.60116379e+00 5.02385226e+00 1.21186041e+02
1716.lowfreq: -4.6253 0.0002 0.0005 0.0007 5.9941 10.2521 20.0810 28.0602 39.0902
frequency: 19.8746 27.9945 39.0243 58.4591 61.2634 69.2240 83.4984 98.2386 104.4427 113.6611 126.1276 146.5614 154.5138 161.7582 172.2375 203.7054 230.7103 233.3438 249.0670 288.9062 311.8387 318.0485 338.0339 385.4202 418.0337 438.9426 488.3563 510.6114 551.3128 574.2299 603.6375 612.9691 621.2319 711.7702 725.3796 736.0910 754.6237 755.0687 783.5430 814.0492 841.6965 867.1870 892.8836 921.7472 937.0568 962.0694 986.1933 1010.2948 1035.5208 1045.2036 1073.7907 1081.4591 1091.5187 1108.4148 1120.9065 1133.1675 1146.6241 1153.3267 1160.5211 1199.0315 1221.7320 1229.1510 1256.0645 1268.1381 1279.4469 1281.0474 1298.6791 1317.7574 1333.5950 1337.8332 1349.5901 1359.4242 1373.5359 1391.8971 1421.5867 1437.8743 1444.3072 1451.2722 1454.9178 1459.4643 1466.0336 1473.0227 1478.8911 1483.1642 1497.7805 1522.3503 1587.5586 1631.2897 1636.6308 1658.6421 2965.3086 2970.4644 2977.4340 2993.7304 2994.4938 2998.3364 3011.2322 3025.9170 3033.4797 3041.2141 3065.4365 3067.3417 3095.9894 3103.6686 3105.8424 3116.0566 3136.3505 3408.0086 3445.4498 3561.6854 3564.3917
redmass: 4.1069 4.9283 6.0266 6.3367 5.6914 5.2071 4.9458 2.4605 3.2446 1.3720 2.1467 2.0073 2.5917 1.1737 1.5327 2.6384 4.6599 3.4715 4.1094 4.1638 2.3159 3.5599 2.7646 2.9755 4.1958 2.8200 2.7972 3.4116 1.8920 2.9433 1.9941 3.5432 3.6077 1.4779 1.2788 3.9719 1.3878 3.4378 2.5188 2.4759 2.6576 1.9582 4.6495 3.1465 3.3585 2.2131 1.8495 2.1990 2.3708 1.6481 1.9092 3.0588 2.2688 3.1732 2.1342 1.5663 2.0636 1.4425 1.4755 1.7180 1.5284 1.4311 1.3555 1.7838 1.7077 1.3688 1.2521 1.1325 1.2749 1.3926 1.3510 1.3350 1.4961 1.2268 1.1727 1.1421 1.0889 1.0463 1.0762 1.0555 1.0974 1.1035 1.0847 1.0580 1.9952 1.7466 5.1757 9.2286 5.8539 1.0897 1.0595 1.0679 1.0596 1.0295 1.0596 1.0359 1.0990 1.0621 1.0846 1.1027 1.1038 1.0958 1.0983 1.1009 1.1052 1.1022 1.1052 1.0804 1.0455 1.0955 1.0786
irintensity: 0.1403 0.5879 1.9306 2.2033 2.9692 8.4836 6.2876 3.0036 8.3477 1.7915 4.4701 7.5552 3.5629 6.4990 43.8378 25.9021 4.6469 0.8034 16.8077 4.7454 8.3347 18.5368 22.4275 4.5895 3.5807 14.5390 7.4156 3.9327 45.3522 45.0777 31.6938 4.9380 22.7117 131.0962 121.2356 7.1205 92.2509 17.1297 4.3905 13.7213 1.4548 4.9118 2.2386 3.8443 11.0980 8.7302 5.3331 6.8599 2.3568 15.8940 13.2974 2.7950 45.7175 15.0074 81.5501 43.9183 26.7860 8.3206 34.1800 2.9696 17.7876 11.4621 37.4715 4.1427 41.5458 22.0869 5.4068 2.0632 7.3706 1.3112 5.2285 3.4193 4.3520 47.8645 19.9740 31.6777 5.7476 24.2150 6.7438 17.5998 57.0482 13.8947 23.3001 3.8992 107.2660 255.6081 97.2607 159.7473 354.7061 54.5876 5.3337 35.8021 37.5571 33.3647 37.2257 10.8875 0.5236 17.2341 23.2207 41.0751 67.7297 8.6155 9.0827 19.7852 6.8042 6.5741 20.5573 106.5196 0.6194 2.2342 28.8341
temp: 298.150 k
press: 1.00000 atm
elementType: 8 8 8 8 7 7 7 6 6 6 6 6 6 6 6 6 6 6 1 1 1 1 1 1 1 1 1 1 1 1 1 1 1 1 1 1 1 1 1
symmnumber: 1
zpe: 855024.5 jmol-1
zpe.correction: 0.325662 hartree
zpe.thermalcorrener: 0.347113 hartree
zpe.thermalcorrenthalpy: 0.348057 hartree
zpe.thermalcorrgfe: 0.272975 hartree
zpe.sumelectzpe: -895.512168 hartree
zpe.sumelectthermal: -895.490717 hartree
zpe.sumelectthermalent: -895.489773 hartree
zpe.sumelectthermalfe: -895.564855 hartree
dipole: 0.5764 4.3823 2.1024
dipole: 4.8945
quadrupole: -111.5792 -103.5455 -110.1478
quadrupole: 17.2098 -1.0663 7.3186
quadrupole: -3.1550 4.8786 -1.7236 17.2098 -1.0663 7.3186
hfenergy: -895.83783 hartree
pointgroup: C01 [X(C11H21N3O4)]
dipole: 0.6870353 1.6085608 0.8054012 debye
polarizability: 175.13806|-2.8600067|160.3509525|-0.5226918|5.4617049|120.9088141 unknown
InChI: InChI=1S/C11H21N3O4/c1-8(15)14-7-10(16)13-6-4-3-5-9(12)11(17)18-2/h9,13-14H,3-7,12H2,1-2H3
charge 0 multiplicity 1
39 atoms
O  -2.133749 2.083053 0.714326
O  -3.036864 1.2877 -1.281733
O  3.533778 -2.892038 -0.457473
O  1.386056 1.175332 -0.836177
N  1.495932 -1.781291 -0.807693
N  -4.517689 -0.712493 0.145551
N  3.5329 0.50711 -0.271641
C  -1.450026 -1.431032 0.219363
C  -2.324126 -0.841792 1.348123
C  -0.365092 -2.391984 0.758738
C  -3.485153 0.068311 0.84305
C  0.629048 -2.870569 -0.323952
C  -2.895231 1.193644 -0.040046
C  2.870211 -1.867479 -0.809225
C  3.572349 -0.568593 -1.282164
C  -1.388679 3.118825 -0.056102
C  2.435062 1.326216 -0.11926
C  2.545045 2.421954 0.931803
H  -0.973984 -0.597155 -0.335659
H  -2.083299 -1.977892 -0.508146
H  -1.68526 -0.25279 2.033743
H  -2.794971 -1.656423 1.929385
H  0.20263 -1.900747 1.574211
H  -0.855691 -3.282224 1.200873
H  -3.940989 0.541304 1.73214
H  1.300062 -3.654163 0.068949
H  0.067906 -3.30542 -1.176555
H  1.083942 -0.871257 -1.060459
H  -5.425715 -0.236799 0.108812
H  -4.225489 -0.986674 -0.80024
H  3.08886 -0.188995 -2.20008
H  4.622852 -0.818633 -1.495569
H  4.319756 0.595406 0.372599
H  -1.063936 3.849323 0.699604
H  -2.049707 3.585637 -0.804796
H  -0.525098 2.642486 -0.551743
H  3.487036 2.386047 1.505001
H  2.471587 3.406184 0.436817
H  1.695939 2.340811 1.631724
