program: Gaussian 09
title: 000084746
version: EM64L-G09RevD.01
frameworkgroup: C1[X(C18H24O3S)]
method: RPBEPBE
basis: SDD
operation: Freq
keyword: #p
keyword: freq=noraman
keyword: PBEPBE/SDD
title: #p freq=noraman PBEPBE/SDD
converged: YES YES NO NO
title: Mulliken charges:
elementType: S O O O C C C C C C C C C C C C C C C C C C H H H H H H H H H H H H H H H H H H H H H H H H
charge: 0.895958 -0.558458 -0.528165 -0.487840 0.106341 0.504956 0.116154 -0.408718 0.398933 0.558634 0.407362 -0.746093 -0.704298 -0.709868 -0.670270 -0.384439 -0.541988 -0.302464 -0.465639 -0.697878 -0.698109 -0.748137 0.223456 0.213559 0.230914 0.208489 0.210453 0.270488 0.258857 0.216211 0.211998 0.265082 0.264694 0.244287 0.234366 0.266738 0.211416 0.219748 0.224315 0.220288 0.211381 0.224151 0.222781 0.216877 0.216942 0.376533
chargesum: 0.00000
title: Mulliken charges with hydrogens summed into heavy atoms:
elementType: S O O O C C C C C C C C C C C C C C C C C C
charge: 0.895958 -0.181924 -0.528165 -0.487840 0.106341 0.504956 0.116154 -0.408718 0.398933 0.558634 0.407362 -0.078165 -0.014869 -0.022802 -0.405188 -0.119745 -0.297701 -0.035726 -0.231273 -0.042398 -0.042289 -0.091537
polarizability: 3.46541976e+02 1.14913788e+01 2.35873909e+02 -1.82552200e+00 -2.42087489e+00 1.55152960e+02
1716.lowfreq: -12.3028 -6.6536 -0.0021 -0.0010 0.0011 4.2076 14.2707 39.0749 41.6772
frequency: 8.3886 39.0522 41.6751 58.6998 104.6060 109.5458 135.1117 149.8550 160.4703 167.7671 175.8070 185.1544 191.7165 193.8421 199.8848 218.7260 227.1839 245.6057 255.2537 260.8144 294.1294 303.5346 307.4252 320.1891 326.4064 338.6663 361.6824 370.8298 380.5253 397.4648 403.2857 417.2649 422.6991 455.2810 458.0017 497.8738 506.9758 527.4793 534.1631 552.2736 554.3232 619.3565 661.6927 690.2113 694.7569 787.0834 789.8013 800.8599 825.4128 832.7972 836.5787 846.2227 900.1574 908.1084 920.7008 926.4907 929.4263 931.6757 940.2056 944.7566 946.5739 952.0641 967.9708 984.9105 1020.2526 1022.6949 1025.5156 1033.9783 1062.7347 1100.7790 1126.1845 1154.1005 1194.9692 1201.7000 1204.4782 1214.9724 1216.3539 1234.6623 1241.6215 1280.2822 1288.7870 1315.7928 1358.0050 1375.8111 1378.2556 1379.0232 1380.9527 1384.6374 1404.6439 1409.9314 1411.6916 1454.5829 1460.1416 1462.7759 1465.5911 1467.4864 1475.4371 1477.9808 1480.5468 1486.9642 1490.2734 1497.9164 1499.1424 1500.6809 1512.9287 1548.4136 1605.0732 1634.0688 2973.2292 2975.5122 2976.1205 2980.0087 2981.0584 2988.6238 3066.2622 3069.5235 3070.0866 3070.8593 3071.1116 3074.5455 3078.4559 3080.2552 3081.1851 3083.3600 3122.4211 3129.5967 3130.4698 3137.9528 3145.4375 3203.2329 3204.8357 3464.9639
redmass: 4.3021 4.3280 3.8959 4.3464 3.4042 4.4575 3.0660 2.2870 1.8195 3.4885 3.8744 3.7104 1.3500 1.6984 1.8153 1.6125 2.3364 1.4425 1.7467 3.1319 4.3617 3.9075 1.0651 3.1516 3.2367 3.7137 1.7386 2.1659 1.8548 2.9866 2.6460 6.4590 2.8797 3.0116 3.2951 2.7761 5.3638 5.3722 5.5418 2.9747 5.0873 3.2508 6.8584 5.5247 3.3282 5.2377 2.3777 3.3276 4.2397 1.4557 2.4472 3.5314 3.7405 1.7325 1.6671 2.0090 1.7376 1.7359 3.3353 2.0244 1.9473 1.2128 1.4081 1.4255 1.4208 1.4086 1.3878 1.3698 1.2152 2.4458 2.3848 2.4339 1.7290 2.9308 2.9602 2.1144 2.2483 2.1341 1.9279 2.6847 2.0624 1.7581 2.3466 2.5125 1.2040 1.2155 1.6230 1.1713 1.4187 3.4794 1.1997 1.0499 1.0506 1.2556 1.0481 1.0821 1.3630 1.0513 1.2159 1.0620 1.2108 1.3957 1.2528 1.1311 1.0705 6.9985 6.6463 6.3747 1.0350 1.0348 1.0358 1.0358 1.0378 1.0390 1.0997 1.1002 1.1002 1.0993 1.1000 1.1004 1.0986 1.0996 1.0980 1.0991 1.0972 1.0957 1.0910 1.0895 1.0905 1.0912 1.0929 1.0660
irintensity: 0.1723 0.2620 0.4942 1.1400 0.1803 0.8073 0.9663 2.4057 0.6573 3.9982 1.0885 20.9558 2.3973 36.0877 5.4000 4.7269 0.2031 0.3459 0.1153 3.2489 17.4239 2.0607 0.3980 20.8086 2.9744 8.3726 0.6940 3.5004 0.5972 5.9266 0.2513 63.2576 12.0993 1.8926 0.3833 0.3100 58.4526 25.4906 15.3163 0.3783 29.6880 2.0438 3.9839 2.4766 8.9601 3.3779 1.1639 9.5074 30.3400 32.8668 27.5036 14.6111 17.3981 16.3877 7.2767 29.9442 4.9730 0.7178 14.0761 40.6659 45.2911 0.3404 1.7480 2.5201 3.3759 1.2537 0.3885 0.6340 57.4342 15.3523 21.2306 5.3619 8.9228 4.2834 5.7463 15.9160 7.7876 12.5287 64.8775 38.8390 3.6272 0.7149 12.1200 7.4418 18.8736 6.9405 29.1118 25.8807 2.2275 31.1044 17.8420 0.7695 0.0474 2.3864 0.6031 2.7672 2.4750 2.1788 28.8636 12.6971 7.6980 1.6420 44.8527 12.1829 11.3526 12.8487 26.8494 6.1066 27.5765 30.4806 17.2575 41.0718 47.4634 48.6014 9.8865 1.2725 8.8605 6.1208 19.9486 41.5372 145.9886 27.1180 74.2628 42.9196 1.0626 4.5929 6.1555 17.4054 9.4844 5.0311 1.8533 43.9986
temp: 298.150 k
press: 1.00000 atm
elementType: 16 8 8 8 6 6 6 6 6 6 6 6 6 6 6 6 6 6 6 6 6 6 1 1 1 1 1 1 1 1 1 1 1 1 1 1 1 1 1 1 1 1 1 1 1 1
symmnumber: 1
zpe: 984522.9 jmol-1
zpe.correction: 0.374985 hartree
zpe.thermalcorrener: 0.399136 hartree
zpe.thermalcorrenthalpy: 0.400080 hartree
zpe.thermalcorrgfe: 0.322005 hartree
zpe.sumelectzpe: -1322.211167 hartree
zpe.sumelectthermal: -1322.187015 hartree
zpe.sumelectthermalent: -1322.186071 hartree
zpe.sumelectthermalfe: -1322.264147 hartree
dipole: -2.6601 3.9566 -1.3449
dipole: 4.9538
quadrupole: -129.1722 -134.7621 -147.1006
quadrupole: 8.9227 -2.5649 6.4748
quadrupole: 7.8394 2.2495 -10.0889 8.9227 -2.5649 6.4748
hfenergy: -1322.5861516 hartree
pointgroup: C01 [X(C18H24O3S1)]
dipole: -1.0168294 -1.6388736 0.2803217 debye
polarizability: 346.9399798|-9.4336718|234.4038543|2.7015387|9.2579012|156.2250106 unknown
InChI: InChI=1S/C18H24O3S/c1-17(2,3)13-8-9-14-12(11-13)7-10-15(18(4,5)6)16(14)22(19,20)21/h7-11,19H,1-6H3
charge 0 multiplicity 1
46 atoms
S  1.990205 2.041876 0.295884
O  1.107419 2.399677 1.908712
O  3.549984 2.279729 0.675135
O  1.389081 2.990806 -0.866827
C  3.687556 -0.985515 -0.086372
C  2.127714 -0.904967 -0.022563
C  -4.59871 -0.130027 -0.015058
C  1.294277 0.228487 0.09634
C  -0.153005 0.219713 0.071113
C  -3.057475 -0.057589 0.008107
C  -0.800064 -1.075131 -0.031888
C  4.181004 -2.427672 -0.416216
C  4.302006 -0.626939 1.30334
C  4.243028 -0.081745 -1.231205
C  -2.229393 -1.179508 -0.055969
C  1.402753 -2.149395 -0.116142
C  0.017941 -2.238305 -0.110213
C  -1.022222 1.364033 0.129405
C  -2.406507 1.220806 0.098999
C  -5.131628 0.67137 -1.241624
C  -5.15993 0.500049 1.296262
C  -5.118111 -1.586302 -0.118392
H  3.793599 -2.79879 -1.383104
H  3.932913 -3.156626 0.376801
H  5.282281 -2.397287 -0.491297
H  3.924127 -1.318631 2.079001
H  5.401645 -0.736998 1.253073
H  4.085086 0.407997 1.603632
H  4.110771 0.992429 -1.040819
H  3.768453 -0.3424 -2.195111
H  5.330738 -0.254671 -1.330033
H  -2.65476 -2.185447 -0.130468
H  1.979069 -3.070127 -0.200606
H  -0.462579 -3.221113 -0.180063
H  -3.016432 2.129754 0.145098
H  -0.610149 2.370544 0.194759
H  -6.237179 0.643444 -1.261073
H  -4.821849 1.731034 -1.206521
H  -4.757127 0.240276 -2.187984
H  -4.844856 1.551978 1.414736
H  -6.265655 0.477096 1.283705
H  -4.811244 -0.059761 2.183255
H  -6.223221 -1.58524 -0.129316
H  -4.775098 -2.077917 -1.047643
H  -4.792979 -2.198824 0.742996
H  1.640524 3.139529 2.325252
