program: Gaussian 09
title: 000084575
version: EM64L-G09RevD.01
frameworkgroup: C1[X(C8H11NO4S2)]
method: RPBEPBE
basis: SDD
operation: Freq
keyword: #p
keyword: freq=noraman
keyword: PBEPBE/SDD
title: #p freq=noraman PBEPBE/SDD
converged: YES YES NO NO
title: Mulliken charges:
elementType: S S O O O O N C C C C C C C C H H H H H H H H H H H
charge: 0.975317 1.028625 -0.496157 -0.532037 -0.538016 -0.516018 -0.631492 -0.091592 -0.214155 -0.253853 0.454149 -0.368882 -0.365070 -0.720543 -0.795839 0.339410 0.320954 0.297218 0.251370 0.249094 0.278868 0.289738 0.326171 0.246738 0.231448 0.234555
chargesum: 0.00000
title: Mulliken charges with hydrogens summed into heavy atoms:
elementType: S S O O O O N C C C C C C C C
charge: 0.975317 1.028625 -0.496157 -0.532037 -0.538016 -0.516018 -0.292082 -0.091592 0.106799 0.043365 0.454149 -0.117512 -0.115976 0.174234 -0.083099
polarizability: 2.27800756e+02 -1.33961651e+00 1.56794002e+02 5.48516505e+00 -1.13026141e+01 1.15098651e+02
1716.lowfreq: -9.1683 -5.0180 -0.0022 -0.0015 -0.0013 5.8374 15.4552 31.5025 41.8667
frequency: 15.0510 31.2991 41.8471 60.1513 100.0752 112.1427 118.4109 149.6806 163.7636 179.0038 186.7641 214.8356 240.1443 252.0878 276.6369 297.3348 323.6809 346.7288 349.9959 376.2146 403.9963 405.9666 431.8192 463.0489 502.6170 566.6637 579.2969 619.7556 699.2060 739.3830 775.0949 813.9295 818.8888 825.9663 844.4577 905.3935 950.1687 962.7147 982.3174 986.9139 992.1857 1001.2949 1044.7808 1046.3489 1049.8259 1125.7981 1170.6835 1193.8813 1219.9368 1305.3923 1314.8480 1381.4953 1393.3061 1400.8130 1406.8361 1427.7261 1470.0289 1471.5844 1473.8021 1588.8631 1590.1468 2982.8527 3018.8048 3065.8513 3096.0543 3138.2548 3140.3289 3154.6158 3165.7949 3168.0257 3192.8504 3279.3266
redmass: 1.0143 4.3846 5.7964 5.5693 5.3860 6.7103 7.2130 4.8494 12.2018 5.8885 1.1407 5.4949 5.2456 4.0593 5.1984 5.5812 5.0733 8.5321 4.0254 4.2227 6.6991 3.1201 10.9969 5.4679 3.4772 5.6572 6.0268 6.9494 3.2571 1.8076 4.8353 6.1172 7.0450 1.5695 1.2634 3.9362 8.8705 1.3153 1.5957 3.5871 1.4256 1.3136 1.9361 2.0083 1.5964 1.3063 1.1518 1.1327 3.1100 1.2576 1.1287 6.9555 2.7566 1.2180 1.0481 1.0517 1.1827 1.8451 1.0988 6.3888 6.1876 1.0392 1.0253 1.0945 1.1003 1.0891 1.0895 1.0975 1.0963 1.1076 1.1081 1.0756
irintensity: 0.6298 0.7373 3.3434 1.2082 7.0498 6.6125 0.6880 0.9074 1.6810 3.3717 1.2523 9.4945 3.0215 6.2467 2.9005 16.4488 36.4738 20.1151 21.0421 12.7975 28.8403 5.1694 54.7167 159.0832 156.9730 36.5626 28.5032 1.8661 4.2108 35.0012 2.4107 10.1748 170.2623 40.9516 1.0957 33.5633 70.9549 2.4698 1.1221 0.7297 2.5606 21.8107 58.6902 14.1179 23.7900 7.4413 6.0344 15.7651 5.2633 2.4802 9.8672 1.0911 13.2667 17.9586 12.0629 13.5267 21.1768 24.0005 15.5886 2.2989 13.7641 19.0182 5.2553 16.9607 13.3518 15.4473 5.0296 17.3105 11.9084 5.8945 1.0216 20.4731
temp: 298.150 k
press: 1.00000 atm
elementType: 16 16 8 8 8 8 7 6 6 6 6 6 6 6 6 1 1 1 1 1 1 1 1 1 1 1
symmnumber: 1
zpe: 476028.7 jmol-1
zpe.correction: 0.181310 hartree
zpe.thermalcorrener: 0.199012 hartree
zpe.thermalcorrenthalpy: 0.199957 hartree
zpe.thermalcorrgfe: 0.133759 hartree
zpe.sumelectzpe: -1461.727340 hartree
zpe.sumelectthermal: -1461.709637 hartree
zpe.sumelectthermalent: -1461.708693 hartree
zpe.sumelectthermalfe: -1461.774891 hartree
dipole: -4.1258 -1.4019 0.2663
dipole: 4.3656
quadrupole: -77.9176 -119.5638 -109.4458
quadrupole: 5.8359 10.6990 -6.1134
quadrupole: 24.3915 -17.2548 -7.1367 5.8359 10.6990 -6.1134
hfenergy: -1461.9086498 hartree
pointgroup: C01 [X(C8H11N1O4S2)]
dipole: 1.6475859 -0.3311768 -0.3546591 debye
dipolederiv: 1.9622132 0.1446448 -0.0658928 0.0831089 1.4635223 -0.1017578 -0.5239494 -0.5931877 1.1778641 1.613125 0.2651661 -0.0629379 0.5383257 1.5277722 -0.106689 0.3416862 0.4250438 1.0068291 -0.7056528 -0.0792631 0.0178291 -0.0616304 -0.712359 -0.0375667 0.0808342 -0.0493884 -0.4561028 -0.7540181 0.0527412 -0.0769877 -0.0035867 -0.4511547 -0.0273229 0.000821 0.1774855 -0.5695858 -0.6832952 0.0681493 0.0662275 -0.0725852 -0.5976878 -0.0338715 0.000265 -0.2107743 -0.5502754 -0.6431847 -0.1526676 0.040491 -0.1903915 -0.6512428 0.0920848 0.0411651 0.0911619 -0.5158871 -0.881482 -0.2873134 0.0572972 -0.3761243 -0.7851116 0.0622831 0.1182259 0.013552 -0.5245635 -0.0872469 0.0232882 0.0186176 -0.076934 -0.1833289 0.0592466 0.0090196 0.094549 -0.1685555 -0.1937731 0.0666131 0.0767349 -0.1638179 -0.0295215 -0.0004583 -0.0995421 0.001329 -0.0828867 -0.055322 -0.1131342 -0.0517902 0.2618716 -0.0518403 0.013922 0.2243029 0.0014423 -0.091586 0.5467849 -0.1593641 -0.0874941 -0.1350336 0.0587399 0.0402199 -0.1390713 0.056917 0.0267263 -0.3205302 -0.0197077 -0.0077221 -0.0110158 0.0505587 0.132226 -0.0251725 0.1153089 -0.0450188 -0.1207648 0.1507562 0.1250677 0.1663729 -0.092869 0.0391047 0.108167 0.0371544 -0.1074801 -0.0981281 -0.0007908 0.0247413 -0.0297437 -0.1302886 0.0817545 0.0235176 0.0330463 -0.0884352 -0.2156634 0.0820592 0.0626832 0.0204045 0.0560175 0.006411 0.183331 -0.0343157 0.0287937 0.0500414 -0.0839345 -0.0433081 -0.1068311 0.0037906 0.0670389 -0.1291455 0.0719122 0.2085242 0.1818016 -0.0082386 -0.0627145 0.0223294 0.1118774 -0.0238012 -0.0449565 -0.0050275 0.1561918 0.1722228 0.0619682 0.0189674 0.002043 0.0807453 -0.0481923 0.0005972 -0.0371058 0.1274269 0.0373457 0.0395312 0.0188132 0.0579967 -0.0025147 -0.103849 0.0148523 -0.0879345 0.0885262 -0.0740018 -0.0567748 -0.0572772 -0.0301311 0.076407 -0.0564319 -0.0620215 -0.0611918 0.1085967 0.0384551 -0.0278902 -0.0360925 -0.0149535 0.0364665 -0.0426191 -0.0480052 -0.0427395 0.1017298 0.0605633 0.0422169 0.0042701 0.0428491 0.0890303 -0.0235317 -0.0075882 -0.0184188 0.025067 0.1320751 0.0174979 0.0216916 0.0474749 0.1041418 0.0406233 0.0130877 0.0187435 0.0916013 -0.0121439 0.0065676 0.0669719 -0.0046154 0.0731666 0.0741562 0.0911888 0.0656715 -0.0379334 -0.0073155 0.0058703 -0.0629316 -0.0273002 0.0736755 -0.0808798 -0.149238 -0.0362692 -0.0238599 0.057894 -0.0379911 -0.0052549 0.061918 -0.1179926 -0.0220999 -0.0223711 -0.0269643 0.1142931 unknown
polarizability: 226.0712619|11.3775669|154.389655|-7.9729066|15.7750367|119.2324922 unknown
InChI: InChI=1S/C8H11NO4S2/c1-7-3-5-8(6-4-7)15(12,13)9-14(2,10)11/h3-6,9H,1-2H3
charge 0 multiplicity 1
26 atoms
S  -1.035194 1.249286 0.393165
S  -2.840276 -1.502702 0.722439
O  -0.897574 2.607705 1.267972
O  -1.846982 1.214464 -1.012096
O  -1.868619 -2.210188 -0.37527
O  -3.347042 -2.349928 2.012851
N  -2.083016 0.080027 1.511655
C  0.697635 0.522513 0.186723
C  0.863878 -0.642551 -0.579971
C  1.751549 1.223294 0.796503
C  3.291215 -0.458559 -0.147509
C  2.181894 -1.125083 -0.735039
C  3.056138 0.713691 0.619701
C  -4.289778 -0.664637 -0.169068
C  4.70125 -0.976563 -0.356333
H  -1.49282 -0.244049 2.316721
H  0.008378 -1.170662 -1.014378
H  1.55693 2.130347 1.377554
H  2.345134 -2.037558 -1.319189
H  3.900276 1.237013 1.082588
H  -4.824826 -1.473229 -0.686069
H  -4.882715 -0.187158 0.621637
H  -3.818429 0.063396 -0.846608
H  5.139019 -0.553231 -1.28107
H  5.365863 -0.697623 0.479127
H  4.719113 -2.075116 -0.459735
