program: Gaussian 09
title: 000084655
version: EM64L-G09RevD.01
frameworkgroup: C1[X(C14H8N6O10)]
method: RPBEPBE
basis: SDD
operation: Freq
keyword: #p
keyword: freq=noraman
keyword: PBEPBE/SDD
title: #p freq=noraman PBEPBE/SDD
converged: YES YES NO NO
title: Mulliken charges:
elementType: O O O O O O O O O O N N N N N N C C C C C C C C C C C C C C H H H H H H H H
charge: -0.175697 -0.175674 -0.154489 -0.154525 -0.241727 -0.241644 -0.188523 -0.188524 -0.186816 -0.186813 -0.460819 -0.460799 0.035787 0.035744 0.021444 0.021441 0.402618 0.402673 0.221125 0.221089 -0.267810 -0.267861 -0.492276 -0.492274 0.455571 0.455577 -0.395236 -0.395239 0.085822 0.085863 0.328693 0.328679 0.340439 0.340461 0.369947 0.369888 0.301941 0.301942
chargesum: 0.00000
title: Mulliken charges with hydrogens summed into heavy atoms:
elementType: O O O O O O O O O O N N N N N N C C C C C C C C C C C C C C
charge: -0.175697 -0.175674 -0.154489 -0.154525 -0.241727 -0.241644 -0.188523 -0.188524 -0.186816 -0.186813 -0.090872 -0.090911 0.035787 0.035744 0.021444 0.021441 0.402618 0.402673 0.221125 0.221089 0.060883 0.060818 -0.151837 -0.151813 0.455571 0.455577 -0.093294 -0.093297 0.085822 0.085863
polarizability: 4.54378794e+02 1.04324276e-02 2.67652512e+02 3.73598129e+01 -1.21052808e-02 1.29854687e+02
1716.lowfreq: -7.1208 -2.4401 -1.9623 -0.0004 0.0005 0.0006 12.8720 15.3582 18.7835
frequency: 12.8659 15.3559 18.7817 49.9250 51.1134 55.2420 63.8232 66.7335 75.6351 92.0549 100.8740 116.0282 149.1908 160.1026 160.4908 164.4720 174.2443 185.8441 247.9528 264.3387 287.8630 319.3008 323.5695 331.6886 332.6210 356.8958 371.8815 372.6591 405.6406 411.0796 436.3024 436.3745 491.2967 497.3092 519.2868 526.8703 545.0937 580.0079 597.5217 636.1495 640.5425 655.0743 655.1915 670.6180 684.8904 711.5998 712.0554 737.0580 737.4424 754.1083 757.0320 762.9010 772.1585 810.4594 845.2226 874.6184 880.2016 882.2709 883.1928 890.2523 918.5267 957.9673 965.4565 965.7858 1019.6104 1019.6955 1049.6450 1053.4197 1096.3186 1103.0560 1104.1377 1144.1783 1144.8067 1161.6996 1166.9740 1196.0519 1208.7573 1214.7636 1241.0829 1243.3391 1296.4025 1301.5525 1335.5738 1352.8524 1360.1212 1364.3581 1388.4008 1391.6710 1428.0000 1428.4558 1479.1905 1481.4852 1521.5423 1539.0785 1585.0939 1591.5639 1613.0706 1616.5847 1622.3599 1638.4261 3172.2524 3174.5338 3182.0807 3182.1123 3188.5278 3188.5881 3200.1269 3200.2173
redmass: 12.9085 11.0839 12.8307 12.6343 12.8905 13.1814 9.7001 13.5423 8.8192 12.6221 12.8172 11.6721 8.4590 5.9912 5.6295 11.3645 9.5344 9.8337 13.1173 10.1916 9.6626 8.5156 9.9229 10.3335 9.5148 10.1338 12.1435 13.3028 9.0128 7.9659 3.9947 4.0685 11.0727 10.6389 4.5344 3.8903 5.7093 5.9771 7.8668 8.2608 7.9299 8.1559 8.0142 10.7650 11.5431 6.7921 6.9714 4.9424 5.5771 10.5660 12.3168 10.8839 7.6398 7.3754 6.7055 7.6859 8.0410 1.3144 1.4250 1.2281 7.2597 1.1239 1.4234 1.4026 1.3320 1.3325 2.5256 2.2356 3.9346 3.3385 3.9546 1.4551 1.4299 7.1601 11.0122 5.6204 8.3493 8.5585 1.6993 1.6308 2.0729 2.0696 5.4611 7.3014 5.7651 5.8293 10.7885 9.9424 6.3382 6.0694 3.3526 3.4824 2.2036 2.7679 5.9917 5.5956 5.0924 6.3608 8.6638 3.8007 1.0811 1.0809 1.0909 1.0909 1.0921 1.0921 1.0966 1.0966
irintensity: 0.0479 0.1602 0.0211 0.0746 2.4926 3.5045 0.5299 0.6758 6.4734 1.2158 7.9683 0.5044 1.1853 3.6695 0.7811 4.3083 2.7468 3.3264 2.4919 1.7757 11.9947 2.4581 0.7769 2.2749 1.6133 2.2106 8.3629 0.5538 0.0012 21.6214 0.2090 1.4674 13.2261 2.2384 13.8353 2.5928 13.0855 0.6970 4.1860 3.3902 6.2334 6.1560 24.5853 5.1822 48.7520 2.4958 12.9210 1.8493 0.1202 8.9814 6.4536 6.7566 78.7744 1.1324 54.3373 1.8168 20.8738 14.8285 13.1479 203.1774 4.7774 18.0376 40.2709 14.3655 0.0477 1.0885 23.4997 4.7646 105.1478 189.9969 2.1395 20.7199 64.1510 141.0632 575.4815 9.9138 678.3206 54.3117 47.8733 19.0348 48.2551 6.5703 701.4719 365.6750 52.2935 8.9212 46.5451 161.9616 14.1645 46.1769 287.5109 55.3928 423.1360 91.8902 274.9885 455.8738 129.8765 0.9166 164.4396 52.8981 82.2023 206.8402 7.0970 6.9075 17.0863 48.2162 6.2981 8.1998
temp: 298.150 k
press: 1.00000 atm
elementType: 8 8 8 8 8 8 8 8 8 8 7 7 7 7 7 7 6 6 6 6 6 6 6 6 6 6 6 6 6 6 1 1 1 1 1 1 1 1
symmnumber: 1
zpe: 616799.7 jmol-1
zpe.correction: 0.234927 hartree
zpe.thermalcorrener: 0.260433 hartree
zpe.thermalcorrenthalpy: 0.261377 hartree
zpe.thermalcorrgfe: 0.174868 hartree
zpe.sumelectzpe: -1616.606306 hartree
zpe.sumelectthermal: -1616.580800 hartree
zpe.sumelectthermalent: -1616.579855 hartree
zpe.sumelectthermalfe: -1616.666364 hartree
dipole: -0.0007 2.7185 -0.0009
dipole: 2.7185
quadrupole: -231.5657 -196.0660 -171.7270
quadrupole: 0.0064 -2.2960 -0.0018
quadrupole: -31.7795 3.7202 28.0593 0.0064 -2.2960 -0.0018
hfenergy: -1616.8412323 hartree
pointgroup: C01 [X(C14H8N6O10)]
dipole: 0.000069 -1.0695251 -0.0001261 debye
polarizability: 453.2956754|0.0651413|267.6525181|-41.7860576|0.0365401|130.9378003 unknown
InChI: InChI=1S/C14H8N6O10/c21-13(15-9-3-1-7(17(23)24)5-11(9)19(27)28)14(22)16-10-4-2-8(18(25)26)6-12(10)20(29)30/h1-6,15-16H
charge 0 multiplicity 1
38 atoms
O  -1.304009 -3.125535 0.69103
O  1.30504 -3.124317 -0.693744
O  -2.880152 2.757245 -1.631376
O  2.878774 2.758088 1.633029
O  -1.110797 1.350247 -1.431044
O  1.109527 1.351185 1.432087
O  -7.680185 -0.314842 0.956129
O  7.679941 -0.309618 -0.955779
O  -7.263886 1.675357 -0.086119
O  7.262322 1.679643 0.087736
N  -1.40281 -0.945775 -0.234864
N  1.402758 -0.945235 0.234076
N  -2.375129 1.646701 -1.244353
N  2.373827 1.647742 1.245368
N  -6.897733 0.526606 0.36995
N  6.896989 0.530813 -0.368802
C  -2.755893 -0.607791 -0.083617
C  2.755668 -0.606196 0.083245
C  -3.24454 0.660284 -0.56701
C  3.243533 0.661874 0.567569
C  -3.69103 -1.481331 0.548647
C  3.691419 -1.478735 -0.549508
C  -4.596486 1.03133 -0.418143
C  4.595314 1.033719 0.419171
C  -5.472988 0.139829 0.211959
C  5.472426 0.143141 -0.211365
C  -5.034069 -1.114781 0.696641
C  5.034282 -1.111349 -0.697016
C  -0.758555 -2.127187 0.159679
C  0.759162 -2.126659 -0.16151
H  -3.334795 -2.446591 0.911242
H  3.335813 -2.443934 -0.912848
H  -4.948514 1.9974 -0.788899
H  4.946757 1.999745 0.790602
H  -0.868082 -0.210536 -0.747087
H  0.867631 -0.210733 0.746929
H  -5.751987 -1.782635 1.18003
H  5.752659 -1.778469 -1.180733
