program: Gaussian 09
title: 000084549
version: EM64L-G09RevD.01
frameworkgroup: C1[X(C2Br6OS)]
method: RPBEPBE
basis: SDD
operation: Freq
keyword: #p
keyword: freq=noraman
keyword: PBEPBE/SDD
title: #p freq=noraman PBEPBE/SDD
converged: NO YES NO NO
title: Mulliken charges:
elementType: Br Br Br Br Br Br S O C C
charge: 0.205864 0.179836 0.242808 0.213924 0.202477 0.182265 0.778320 -0.481880 -0.762273 -0.761343
chargesum: 0.00000
title: Mulliken charges with hydrogens summed into heavy atoms:
polarizability: 1.91936770e+02 -2.42186895e+00 1.60001165e+02 -3.41706452e-01 3.93912762e+00 1.44050263e+02
1716.lowfreq: -7.9635 -0.0005 0.0008 0.0012 2.1168 4.2279 22.1589 25.6314 56.5395
frequency: 21.9545 25.6266 56.5388 74.0621 81.5728 87.8275 98.2332 146.0090 151.7425 155.2643 156.3546 179.3455 206.5005 219.6195 232.8374 308.2427 332.6252 462.0678 520.6415 587.8004 622.8198 636.2041 659.8916 886.3435
redmass: 35.3389 77.3688 67.2224 68.1247 49.9940 64.4803 34.3070 51.0174 64.4012 66.8974 43.7210 24.6856 41.1618 51.8918 43.4285 28.5869 28.3467 12.8174 12.7447 12.7823 12.6692 12.7589 12.7303 19.2211
irintensity: 0.4220 0.0170 0.0312 0.0815 0.7861 0.1844 0.6655 0.3873 0.0686 0.0691 0.4248 0.0818 0.1441 0.7065 2.3923 23.7206 12.9398 105.2364 8.9555 52.8316 129.8835 134.1119 224.0160 48.2238
temp: 298.150 k
press: 1.00000 atm
elementType: 35 35 35 35 35 35 16 8 6 6
symmnumber: 1
zpe: 41331.7 jmol-1
zpe.correction: 0.015742 hartree
zpe.thermalcorrener: 0.030870 hartree
zpe.thermalcorrenthalpy: 0.031814 hartree
zpe.thermalcorrgfe: -0.033193 hartree
zpe.sumelectzpe: -629.337634 hartree
zpe.sumelectthermal: -629.322506 hartree
zpe.sumelectthermalent: -629.321562 hartree
zpe.sumelectthermalfe: -629.386569 hartree
dipole: -0.0936 1.9652 0.6881
dipole: 2.0843
quadrupole: -118.5428 -122.7125 -117.5204
quadrupole: 0.0205 -0.7344 -3.9121
quadrupole: 1.0491 -3.1206 2.0715 0.0205 -0.7344 -3.9121
hfenergy: -629.3533765 hartree
pointgroup: C01[X(C2Br6O1S1)]
dipole: 0.0566013 -0.8066893 -0.1359618 debye
dipolederiv: -0.1183175 -0.0717897 0.0053161 0.1803671 -0.8430016 0.0965112 -0.0463184 0.0614127 -0.0522564 -0.704819 -0.0956894 0.3679972 -0.1036466 -0.0840743 0.119675 0.4306525 0.1104448 -0.416575 -0.1554967 -0.0252104 -0.1266147 -0.1288943 -0.1262002 -0.3005478 -0.3671796 -0.2362884 -0.6494893 -0.1088992 0.0005881 -0.082046 -0.0648197 -0.0791449 0.1438147 0.2034311 0.2153931 -0.7932888 -0.7003447 0.3131012 -0.1210734 0.4537137 -0.3191439 0.0955852 -0.0977541 0.1033209 -0.0615702 -0.1771089 -0.077267 -0.0433019 -0.2884184 -0.6144152 -0.3781803 -0.1283983 -0.3827973 -0.312216 0.323303 0.031545 -0.0702632 0.0253709 0.5804869 -0.2602982 -0.0668392 0.0062137 -0.1266162 -0.2755951 -0.0065226 0.0286425 -0.0230706 -0.6848935 0.2089569 0.020161 -0.14506 -0.0664578 0.9825586 0.3014612 -0.2426832 0.0657769 1.1306008 0.1059521 0.0317384 0.1359081 1.2200321 0.9347195 -0.3702166 0.2840266 -0.1163791 1.0397859 0.1685313 0.0205066 0.1314523 1.2584376 unknown
polarizability: 192.0227448|-1.8268507|159.5211771|0.6213119|4.595456|144.4442763 unknown
InChI: InChI=1S/C2Br6OS/c3-1(4,5)10(9)2(6,7)8
charge 0 multiplicity 1
10 atoms
Br 1.581996 -2.141111 0.241024
Br 3.131233 0.313613 -1.306825
Br 2.074211 0.74277 1.782293
Br -1.61827 -0.618138 1.866425
Br -3.19068 1.080492 -0.455706
Br -1.961683 -1.889184 -1.18346
S  -0.001007 0.731718 -0.833982
O  -0.017772 2.187862 -0.101851
C  1.740713 -0.169546 0.068726
C  -1.738542 -0.238476 -0.076645
