program: Gaussian 09
title: 000084531
version: EM64L-G09RevD.01
frameworkgroup: C1[X(C10H16O)]
method: RPBEPBE
basis: SDD
operation: Freq
keyword: #pfreq=noraman
keyword: PBEPBE/SDD
title: #p freq=noraman PBEPBE/SDD
converged: YES YES NO NO
title: Mulliken charges:
elementType: O C C C C C C C C C C H H H H H H H H H H H H H H H H
charge: -0.316614 -0.319617 0.430192 0.354502 -0.228750 -0.217241 -0.540185 -0.436229 -0.802110 -0.763679 -0.784880 0.242506 0.238544 0.227288 0.269987 0.218237 0.206976 0.223216 0.227445 0.231511 0.227158 0.210822 0.229689 0.211073 0.210780 0.215021 0.234359
chargesum: 0.00000
title: Mulliken charges with hydrogens summed into heavy atoms:
elementType: O C C C C C C C C C C
charge: -0.316614 -0.077111 0.430192 0.354502 0.009794 0.010046 -0.051961 -0.006037 -0.115996 -0.112094 -0.124721
polarizability: 1.06671293e+02 -6.69602456e-01 1.01836623e+02 2.07401395e-01 -2.05835522e+00 9.61270440e+01
1716.lowfreq: -19.7250 -9.8908 0.0005 0.0006 0.0007 7.1533 151.1834 170.0714 177.6838
frequency: 151.1525 170.0657 177.6560 192.9298 214.5789 228.0121 288.7176 322.7809 342.4393 374.6805 382.9820 429.5216 452.4925 484.6920 497.5932 609.0828 631.3302 653.0988 740.4650 794.0883 810.2632 845.9350 884.5565 890.6866 930.7911 936.1316 939.1081 959.4119 989.8714 1000.7059 1033.5534 1057.6214 1061.5890 1083.8977 1091.9681 1116.3884 1150.2433 1190.2798 1195.0949 1216.7568 1219.4499 1237.0378 1256.4320 1266.5274 1295.7579 1312.9341 1337.9530 1375.5503 1389.0697 1393.2352 1412.1739 1447.6244 1459.9636 1464.2962 1468.6307 1473.5818 1474.5254 1485.8914 1494.0656 2967.8451 2971.9250 2979.9255 2981.2743 3024.9190 3026.4760 3034.4372 3048.1526 3051.4867 3056.0467 3067.3489 3076.4447 3079.9625 3086.8566 3089.8656 3122.1467
redmass: 2.1752 1.3206 1.3849 1.6531 2.0268 1.2073 2.1189 2.5506 2.8959 2.4767 2.9990 2.7168 2.8309 2.6406 3.8945 4.2796 3.5145 4.3571 2.6101 3.6092 2.3822 2.5864 2.7387 1.7965 1.9186 1.4374 2.1241 1.7937 1.3773 1.3837 1.4327 2.0370 1.6402 1.1940 1.9083 1.8278 1.6353 1.5698 1.7816 2.5286 1.6836 1.8189 1.5510 1.9417 1.9656 1.9263 1.5284 1.2196 1.2334 1.2177 2.7849 1.0796 1.0629 1.1096 1.0643 1.0706 1.0874 1.0715 1.0514 1.0372 1.0377 1.0375 1.0588 1.0876 1.0830 1.1007 1.0987 1.0684 1.0979 1.0980 1.0909 1.0963 1.0958 1.0992 1.1066
irintensity: 0.7730 0.3074 0.9567 0.0858 0.5613 0.5696 1.2542 1.6505 5.9437 0.0835 1.4925 3.0571 2.5066 2.2796 6.8205 3.8960 0.9960 4.3252 16.1115 11.4111 2.9560 5.6840 0.5927 1.9592 4.4009 1.6311 3.4209 5.3111 5.2176 5.4574 6.5411 3.9281 2.8919 1.6296 14.5381 5.3754 1.8502 8.7776 0.6890 0.5466 3.8281 6.4045 3.8838 8.2841 5.9102 6.4523 4.7459 15.7269 17.8042 18.4618 9.1319 18.2425 1.9111 11.2233 3.3437 7.8833 6.1012 14.5399 10.8693 24.7497 50.2086 29.5926 25.7958 80.8224 10.0963 20.2114 4.8232 48.9713 67.1046 20.0804 29.7233 50.0933 36.3292 24.1739 15.7156
temp: 298.150 k
press: 1.00000 atm
elementType: 8 6 6 6 6 6 6 6 6 6 6 1 1 1 1 1 1 1 1 1 1 1 1 1 1 1 1
symmnumber: 1
zpe: 618786.5 jmol-1
zpe.correction: 0.235683 hartree
zpe.thermalcorrener: 0.246378 hartree
zpe.thermalcorrenthalpy: 0.247322 hartree
zpe.thermalcorrgfe: 0.201128 hartree
zpe.sumelectzpe: -464.954526 hartree
zpe.sumelectthermal: -464.943831 hartree
zpe.sumelectthermalent: -464.942887 hartree
zpe.sumelectthermalfe: -464.989081 hartree
dipole: -1.8894 1.1673 1.2996
dipole: 2.5732
quadrupole: -72.7811 -66.6157 -66.5135
quadrupole: 3.6130 3.2893 -2.1645
quadrupole: -4.1443 2.0210 2.1233 3.6130 3.2893 -2.1645
hfenergy: -465.190209 hartree
pointgroup: C01 [X(C10H16O1)]
dipole: -0.7262705 -0.4182382 -0.5679014 debye
polarizability: 106.6696556|0.7346839|102.1246441|0.1733136|-1.5648371|95.8406609 unknown
InChI: InChI=1S/C10H16O/c1-9(2)6-4-7(9)10(3)8(5-6)11-10/h6-8H,4-5H2,1-3H3
charge 0 multiplicity 1
27 atoms
O  2.126015 0.631528 0.584598
C  -0.194648 -0.474295 0.940091
C  1.183124 -0.528279 0.257752
C  -1.324735 -0.326618 -0.180936
C  -0.975754 1.225157 -0.125443
C  1.404831 0.564486 -0.750441
C  -0.517076 1.00181 1.360856
C  0.26521 1.560738 -0.993325
C  1.868784 -1.874004 0.153539
C  -2.732891 -0.621322 0.384501
C  -1.179481 -1.078507 -1.518475
H  -0.315741 -1.276215 1.689564
H  -1.805042 1.928117 -0.320478
H  2.097192 0.388428 -1.586136
H  0.337693 1.597049 1.712968
H  -1.346089 1.063745 2.083068
H  -0.001236 1.528588 -2.068394
H  0.615394 2.5890 -0.777053
H  1.218192 -2.608399 -0.356977
H  2.81692 -1.793721 -0.405632
H  2.098196 -2.2687 1.16081
H  -2.859662 -1.706785 0.560722
H  -2.93231 -0.101631 1.337475
H  -3.510443 -0.30651 -0.337998
H  -1.352121 -2.16303 -1.375457
H  -1.937196 -0.718932 -2.241385
H  -0.188325 -0.958197 -1.987015
