program: Gaussian 09
title: 000084525
version: EM64L-G09RevD.01
frameworkgroup: C1[X(C9H9NO3S)]
method: RPBEPBE
basis: SDD
operation: Freq
keyword: #p
keyword: freq=noraman
keyword: PBEPBE/SDD
title: #p freq=noraman PBEPBE/SDD
converged: NO NO NO NO
title: Mulliken charges:
elementType: S O O O N C C C C C C C C C H H H H H H H H H
charge: 0.970386 -0.390017 -0.499441 -0.499796 0.002418 -0.031561 0.451967 -0.234527 -0.234337 -0.354729 -0.353746 -0.794833 -0.262449 -0.088424 0.285178 0.285126 0.249859 0.249838 0.234166 0.234057 0.247156 0.266979 0.266731
chargesum: 0.00000
title: Mulliken charges with hydrogens summed into heavy atoms:
elementType: S O O O N C C C C C C C C C
charge: 0.970386 -0.390017 -0.499441 -0.499796 0.002418 -0.031561 0.451967 0.050651 0.050790 -0.104870 -0.103908 -0.079455 0.271262 -0.088424
polarizability: 1.92188223e+02 6.17234567e+00 1.11734371e+02 -6.52077580e-02 1.10319213e-01 1.20098863e+02
1716.lowfreq: -30.6169 -19.1924 -6.9340 0.0007 0.0021 0.0022 8.3800 11.7153 36.5471
frequency: -30.5447 -16.9619 36.4226 39.5841 43.3610 105.1770 129.7427 168.8791 182.3024 229.8112 239.9207 303.6093 311.3913 354.7789 354.8753 384.5534 407.0941 437.5344 462.1213 507.6325 590.2059 608.4508 619.8768 702.3715 777.6299 824.5822 831.3575 845.7768 906.5860 953.8873 963.0350 964.0496 983.8393 990.4437 990.5297 992.4405 1049.7861 1052.3775 1121.5345 1186.8995 1189.3616 1218.0388 1299.0356 1334.0973 1384.0575 1392.7705 1399.5535 1457.5339 1469.4381 1471.1429 1474.5686 1591.3023 1595.2150 2213.3006 2981.8372 2983.6563 3042.2903 3067.1324 3095.9398 3143.6526 3144.8968 3167.4735 3170.3653
redmass: 1.0227 7.8296 7.2701 3.2624 4.0022 5.3799 7.2686 6.9140 7.9714 8.4926 8.0972 5.2636 4.3663 7.3149 4.6193 4.0020 2.8594 7.9769 9.5866 3.4614 6.7905 11.0856 6.9578 3.3259 4.9170 1.8551 3.7371 1.2443 8.5396 11.7290 3.6926 1.4157 1.3965 2.3758 2.5731 1.4879 1.6026 2.4562 1.2870 1.1335 1.0643 3.0990 1.2593 1.2680 6.3383 2.9149 1.2159 1.0808 1.1077 2.2772 1.0723 5.9529 6.9602 12.4514 1.0542 1.0391 1.1063 1.0948 1.1002 1.0892 1.0895 1.0960 1.0974
irintensity: 0.6091 0.1824 2.5664 11.6185 4.3717 7.1191 2.2235 2.6640 4.4043 6.9758 4.3431 8.0203 5.0289 2.8825 0.9989 0.3576 0.0183 16.2014 107.0282 76.9958 11.8945 100.5072 0.1755 0.7028 2.5091 109.2142 17.3732 0.2246 130.7871 72.4734 37.8662 12.7514 0.3949 0.5739 0.7998 6.6984 23.4170 28.6558 7.2087 10.7653 0.3512 7.8094 2.5435 10.6195 0.9509 12.3670 18.8042 16.9034 18.1211 17.5239 14.7336 21.9269 0.0873 0.0508 31.8939 15.3907 3.4918 16.2944 13.3221 11.3511 3.9151 0.0587 9.1386
temp: 298.150 k
press: 1.00000 atm
elementType: 16 8 8 8 7 6 6 6 6 6 6 6 6 6 1 1 1 1 1 1 1 1 1
symmnumber: 1
zpe: 424322.1 jmol-1
zpe.correction: 0.161616 hartree
zpe.thermalcorrener: 0.174963 hartree
zpe.thermalcorrenthalpy: 0.175907 hartree
zpe.thermalcorrgfe: 0.119806 hartree
zpe.sumelectzpe: -1025.611298 hartree
zpe.sumelectthermal: -1025.597951 hartree
zpe.sumelectthermalent: -1025.597007 hartree
zpe.sumelectthermalfe: -1025.653108 hartree
dipole: 6.3671 0.0658 -0.0011
dipole: 6.3674
quadrupole: -78.0009 -108.7028 -85.8845
quadrupole: 14.6692 -0.0175 0.0434
quadrupole: 12.8618 -17.8400 4.9782 14.6692 -0.0175 0.0434
hfenergy: -1025.7729137 hartree
pointgroup: C01 [X(C9H9N1O3S1)]
dipole: -2.4982844 -0.1850425 0.0006712 debye
dipolederiv: 2.2682665 0.0116303 -0.0007913 -0.3170826 1.6135498 0.0005459 -0.002598 0.0011912 1.156979 -1.2536322 0.265219 0.0015616 0.2752961 -0.6452945 -0.0009283 0.000768 -0.0012328 -0.4019364 -0.7116264 -0.0595862 0.032085 0.0146585 -0.5672467 0.0519464 -0.0187881 0.1624819 -0.5628927 -0.7120425 -0.0597208 -0.0326488 0.0145794 -0.5654495 -0.0512587 0.0191516 -0.1619124 -0.5642422 -0.1977893 -0.0292585 0.0001819 0.0254535 -0.16623 -0.0004667 0.0000873 -0.0001712 -0.2105115 -0.0932116 0.0233495 0.000038 -0.0610939 -0.2259779 0.0000944 0.0000717 -0.0002436 -0.090855 0.5612562 0.2226893 0.0002035 0.1802722 0.0636755 0.000041 0.0004595 0.0000732 0.0352516 -0.0877937 0.0183825 0.0983792 0.0296209 -0.0589983 0.0582975 -0.2797799 -0.0968113 -0.0226539 -0.0873969 0.0189992 -0.0981002 0.0277857 -0.0592433 -0.0586224 0.2797273 0.0965682 -0.0226035 -0.2553013 -0.0344936 -0.1369407 -0.0450741 -0.1466602 -0.0621085 -0.1507696 -0.0572638 0.0534386 -0.2544991 -0.0349257 0.1375628 -0.0456198 -0.1473216 0.0611474 0.151292 0.0563595 0.0534654 -0.2757261 -0.1147978 -0.000245 0.0249504 0.0592584 -0.0001972 -0.0017312 -0.0008246 0.0722867 1.0238117 -0.2402893 -0.0013504 0.3133841 0.1551236 -0.0011474 0.0025729 -0.001751 0.3781331 -0.2392566 0.0451826 -0.0000267 -0.0591126 0.0083028 0.0006068 -0.0005599 0.0006802 -0.0080768 0.1285518 -0.0294163 -0.0568635 -0.0139807 0.1364709 -0.0332005 -0.0445724 -0.0090511 0.0727114 0.1286023 -0.0296848 0.0565634 -0.0140912 0.1362352 0.033634 0.0444415 0.0094084 0.0726228 0.0241676 -0.0569892 0.0739598 -0.0770329 0.1221234 0.0388834 0.0690387 0.0281766 -0.0222434 0.0238624 -0.0566567 -0.0743354 -0.0767027 0.1224186 -0.0380087 -0.0695333 -0.0273904 -0.0222153 0.0772385 -0.0150446 0.0170021 -0.0788974 0.0273833 -0.0748562 -0.0383211 -0.1227662 -0.0520798 0.0773537 -0.0150618 -0.0168773 -0.078594 0.0284261 0.0744469 0.0396672 0.122656 -0.0531973 -0.0720732 0.0538744 -0.0002487 0.0772248 -0.0171362 0.000498 -0.0001479 0.0007771 0.1206562 -0.0354176 0.0585147 -0.0074362 -0.0578939 0.063793 -0.0456064 -0.0747823 -0.0585947 0.0087633 -0.0373441 0.0580837 0.0083269 -0.0580499 0.0627978 0.0462594 0.0743059 0.0596407 0.0091997 unknown
polarizability: 191.080392|11.2251084|112.842113|0.037024|-0.1058607|120.0989525 unknown
InChI: InChI=1S/C9H9NO3S/c1-8-2-4-9(5-3-8)14(11,12)13-7-6-10/h2-5H,7H2,1H3
charge 0 multiplicity 1
23 atoms
S  0.862694 1.353482 0.00055
O  1.898758 -0.228001 -0.007288
O  1.136184 2.116637 -1.403877
O  1.142793 2.10501 1.410031
N  4.64786 -2.220393 -0.003569
C  -0.806809 0.517913 0.000631
C  -3.319084 -0.699603 0.001057
C  -1.396602 0.227834 1.240776
C  -1.399738 0.233469 -1.239341
C  -2.667571 -0.386521 1.22431
C  -2.670592 -0.381025 -1.222448
C  -4.696221 -1.336139 0.0012
C  3.34866 0.100404 -0.002986
C  4.060741 -1.183028 -0.004051
H  -0.891565 0.480123 2.178239
H  -0.89716 0.489992 -2.176964
H  -3.156096 -0.628072 2.174551
H  -3.161511 -0.618285 -2.172544
H  -4.852967 -1.966619 -0.890788
H  -4.855029 -1.962044 0.896003
H  -5.485637 -0.560118 -0.001791
H  3.614868 0.67838 0.903894
H  3.619522 0.682506 -0.905797
