program: Gaussian 09
title: 000084514
version: EM64L-G09RevD.01
frameworkgroup: C1[X(C9H10ClN3O2)]
method: RPBEPBE
basis: SDD
operation: Freq
keyword: #p
keyword: freq=noraman
keyword: PBEPBE/SDD
title: #p freq=noraman PBEPBE/SDD
converged: YES YES NO NO
title: Mulliken charges:
elementType: Cl O O N N N C C C C C C C C C H H H H H H H H H H
charge: 0.030467 -0.193087 -0.193117 -0.140010 0.062800 0.062785 -0.332936 -0.332947 0.116879 0.116886 -0.051825 -0.051808 -0.329602 -0.543064 -0.543060 0.234016 0.235923 0.234002 0.235919 0.241422 0.241417 0.228423 0.221050 0.228422 0.221047
chargesum: 0.00000
title: Mulliken charges with hydrogens summed into heavy atoms:
elementType: Cl O O N N N C C C C C C C C C
charge: 0.030467 -0.193087 -0.193117 -0.140010 0.062800 0.062785 0.137002 0.136973 0.116879 0.116886 0.189596 0.189609 -0.329602 -0.093590 -0.093591
polarizability: 1.69640277e+02 4.83112779e-03 1.82802847e+02 -4.62357839e+00 -1.75029166e-03 7.79943068e+01
1716.lowfreq: -3.9852 -2.8308 0.0010 0.0016 0.0018 4.3022 35.1734 38.5334 50.0804
frequency: 35.1716 38.5161 50.0634 65.1684 81.2834 105.4647 115.3998 132.9830 179.8096 212.4100 216.8572 224.3786 259.4090 300.7360 309.8986 399.7700 407.0909 483.7965 524.4973 584.6624 622.4808 647.6314 649.5254 677.0591 700.9991 788.2875 815.1832 877.1786 880.8628 920.5799 930.3629 951.9674 960.4222 967.1068 967.7398 973.8156 1006.8215 1010.3148 1036.5151 1149.6778 1151.0361 1206.2693 1209.3002 1214.7318 1221.3477 1278.0885 1283.7473 1293.1565 1317.5180 1357.5070 1410.0640 1430.5569 1432.0325 1450.9038 1453.6949 1464.7887 1467.6909 1666.4562 1666.4896 3001.0921 3002.0233 3075.9799 3076.0289 3095.2057 3095.2179 3129.4734 3129.5059 3206.7156 3206.7458
redmass: 3.6489 4.4896 3.4952 2.7721 2.2604 4.2702 3.5251 3.4803 10.6346 8.4648 8.2496 7.1668 2.8149 3.5267 5.8103 2.7421 4.3310 3.8893 2.9240 2.0707 8.7376 3.7924 3.0196 3.7415 11.7202 12.6505 6.2510 4.1095 12.3257 1.5371 1.5785 2.9756 1.7516 1.4484 1.4744 2.2322 1.2701 1.2497 6.3560 1.6920 1.6891 1.4507 1.7100 3.0473 4.9603 1.5740 1.2402 1.7051 1.4042 2.3430 4.7116 1.5060 1.3132 1.7176 1.7747 2.0195 1.8021 4.7791 4.7832 1.0583 1.0585 1.1048 1.1049 1.0615 1.0615 1.0950 1.0950 1.1144 1.1144
irintensity: 0.1587 0.0049 0.0120 1.6687 0.0761 3.9035 0.1445 0.0165 0.0727 0.0435 6.0104 2.5038 7.4904 12.4426 11.0222 1.2058 3.0492 1.6410 4.3512 5.7439 2.0750 8.2524 2.3650 10.5152 0.2233 15.4994 1.7210 8.3799 1.2536 11.3003 30.8353 408.6711 18.3124 7.5290 44.5833 173.5180 24.0914 6.0053 189.3114 0.3406 1.1976 34.9477 19.5937 26.6058 205.7663 258.7576 10.1741 302.2767 122.3654 44.0185 2.6386 247.9365 154.5172 406.6835 235.5019 340.4233 349.9798 3.7435 2.2997 8.5496 20.3169 0.2313 24.7415 9.3928 7.2678 13.9481 0.2565 43.8497 0.0497
temp: 298.150 k
press: 1.00000 atm
elementType: 17 8 8 7 7 7 6 6 6 6 6 6 6 6 6 1 1 1 1 1 1 1 1 1 1
symmnumber: 1
zpe: 474051.8 jmol-1
zpe.correction: 0.180557 hartree
zpe.thermalcorrener: 0.195891 hartree
zpe.thermalcorrenthalpy: 0.196835 hartree
zpe.thermalcorrgfe: 0.135294 hartree
zpe.sumelectzpe: -1122.529728 hartree
zpe.sumelectthermal: -1122.514394 hartree
zpe.sumelectthermalent: -1122.513450 hartree
zpe.sumelectthermalfe: -1122.574991 hartree
dipole: -0.0004 6.7750 -0.0002
dipole: 6.7750
quadrupole: -92.0776 -95.1208 -90.5818
quadrupole: -0.0001 1.5660 -0.0001
quadrupole: 0.5158 -2.5274 2.0116 -0.0001 1.5660 -0.0001
hfenergy: -1122.7102846 hartree
pointgroup: C01 [X(C9H10Cl1N3O2)]
dipole: 0.0035443 -2.6654931 0.0002216 debye
dipolederiv: -0.1050781 0.0011566 -0.0008578 0.0011623 -1.0398525 -0.0000013 0.0042392 -0.0002566 -0.0623564 -1.3736771 0.8764875 -0.0228456 0.9134912 -1.1189369 0.0168013 0.0835543 -0.0684933 -0.2860665 -1.3690591 -0.8770032 -0.0225822 -0.914068 -1.1233296 -0.0166926 0.0835468 0.0688906 -0.2860963 -1.6447657 -0.0012931 -0.0075274 -0.0012757 -0.6034364 0.0000591 0.0746447 0.000094 -0.1481376 -0.9884604 -0.5189837 0.0051799 -0.6238347 -1.4973501 -0.0014416 0.0308843 0.0182774 -0.1458044 -0.9913431 0.5202693 0.0052438 0.6250403 -1.494386 0.0016613 0.0305687 -0.0178578 -0.1458207 0.4703431 -0.246192 0.0781749 -0.7066383 0.9940002 -0.006927 -0.0662286 0.1040849 0.2916966 0.4679042 0.2447721 0.078099 0.7052922 0.9963171 0.0070182 -0.0661864 -0.1043912 0.2916702 2.0448661 -0.8092628 0.0045863 -0.620996 1.4420718 -0.0074736 -0.055014 0.0267764 0.2468774 2.0412067 0.8106836 0.0043816 0.6224441 1.4456933 0.0071662 -0.0550436 -0.0271312 0.2468699 0.0727597 -0.0516501 -0.0831026 -0.007648 -0.1342027 -0.1421191 -0.1118979 -0.0956975 0.0201439 0.0725238 0.0522162 -0.0834705 0.008232 -0.1340614 0.141907 -0.1121661 0.0953756 0.0202358 1.3751276 -0.0011227 -0.0246099 -0.0010959 2.2735413 -0.0000593 -0.0615214 0.0000103 0.0440155 -0.0522712 -0.0240247 -0.1440839 -0.0052613 -0.2667654 -0.129106 -0.1006889 -0.1806134 -0.0780628 -0.052451 0.024636 -0.1444144 0.0058488 -0.2667353 0.1287172 -0.1011429 0.1803378 -0.0779101 0.044561 -0.0098201 0.0514543 0.0590682 -0.0521278 0.0364897 0.0909244 0.0467932 -0.0557761 -0.004009 -0.0165946 -0.0962829 0.1196709 -0.0662779 0.0053737 -0.0827741 -0.0525719 -0.0209842 0.0447178 0.0100365 0.0515082 -0.0588583 -0.0522867 -0.0363685 0.0910264 -0.0465751 -0.0558374 -0.0037698 0.0168044 -0.096259 -0.1194671 -0.0664911 -0.0055846 -0.0828749 0.0523823 -0.0209171 0.0103357 0.031238 0.0583758 -0.0536171 0.1283631 0.0874365 0.0704068 0.0907898 -0.0007614 0.0103333 -0.031567 0.0585857 0.0532825 0.1284234 -0.0873109 0.0706344 -0.0905924 -0.0008382 -0.0822743 0.0971438 0.0484316 0.0795635 0.124862 0.0335722 0.0448668 0.0412917 0.1114195 0.0471413 -0.0256409 0.1166164 -0.0089962 0.129213 0.0870674 0.0874916 0.0960807 0.0005923 -0.0818002 -0.0976759 0.0485833 -0.0800912 0.1244355 -0.0334164 0.0450441 -0.0411377 0.1113683 0.0471386 0.0253867 0.1168155 0.0087518 0.129319 -0.0867689 0.0877064 -0.0958666 0.0004797 unknown
polarizability: 169.5294074|-0.0114624|182.8028389|5.6148625|-0.0024242|78.1051845 unknown
InChI: InChI=1S/C9H10ClN3O2/c1-3-5-14-8-11-7(10)12-9(13-8)15-6-4-2/h3-4H,1-2,5-6H2
charge 0 multiplicity 1
25 atoms
Cl -0.0051 4.422084 -0.000249
O  2.356453 0.031691 -0.0927
O  -2.355704 0.025804 0.092614
N  0.000519 -0.078428 -0.000067
N  -1.215434 2.025747 0.050465
N  1.211206 2.028807 -0.051118
C  2.351188 -1.473437 -0.111432
C  -2.346645 -1.479318 0.111508
C  1.148583 0.661408 -0.046778
C  -1.149352 0.658541 0.046612
C  3.777157 -1.902828 -0.306847
C  -3.77146 -1.912245 0.307546
C  -0.002868 2.618545 -0.000604
C  4.404641 -2.79879 0.493225
C  -4.397099 -2.809673 -0.492329
H  1.923186 -1.841085 0.837489
H  1.696137 -1.793432 -0.943765
H  -1.918141 -1.845993 -0.837565
H  -1.690446 -1.797586 0.943596
H  4.293204 -1.467312 -1.172334
H  -4.288191 -1.478061 1.173292
H  5.431111 -3.122533 0.291947
H  3.911702 -3.235388 1.370752
H  -5.422683 -3.135954 -0.290641
H  -3.903466 -3.244966 -1.370117
