program: Gaussian 09
title: 000084460
version: EM64L-G09RevD.01
frameworkgroup: C1[X(C6H7NO4)]
method: RPBEPBE
basis: SDD
operation: Freq
keyword: #pfreq=noraman
keyword: PBEPBE/SDD
title: #p freq=noraman PBEPBE/SDD
converged: YES YES YES YES
title: Mulliken charges:
elementType: O O O O N C C C C C C H H H H H H H
charge: -0.193023 -0.182856 -0.182887 -0.188906 -0.118075 -0.499507 -0.499518 0.214225 0.214244 0.315357 -0.746333 0.271077 0.269088 0.269105 0.271088 0.266588 0.253647 0.266687
chargesum: 0.00000
title: Mulliken charges with hydrogens summed into heavy atoms:
elementType: O O O O N C C C C C C
charge: -0.193023 -0.182856 -0.182887 -0.188906 -0.118075 0.040658 0.040675 0.214225 0.214244 0.315357 0.040589
polarizability: 9.99329203e+01 -4.39850758e-03 8.76566341e+01 4.34429625e+00 2.07644719e-03 6.10533136e+01
1716.lowfreq: -17.5092 -8.8305 -4.1666 -3.4357 -0.0013 -0.0008 -0.0008 43.3696 79.7911
frequency: -13.7009 43.3335 79.7581 81.1592 88.6265 108.3545 275.7798 295.3075 316.5212 394.6097 529.8017 536.2869 540.3099 551.2957 555.8470 619.6663 635.0226 724.7961 749.7083 818.8009 973.8513 993.3968 1006.7147 1016.9545 1035.2844 1042.9318 1146.6154 1147.1825 1170.1745 1210.1066 1232.9410 1294.8131 1295.0488 1385.4790 1438.1804 1449.5471 1452.2814 1453.4561 1664.7616 1709.1547 1742.7244 3013.4768 3030.2302 3039.2446 3084.8674 3102.0534 3103.5762 3148.2791
redmass: 1.6707 2.9970 1.9186 4.9132 2.4660 9.7294 4.9524 10.5256 6.8985 5.5363 3.5369 4.9328 3.5173 3.1896 4.1012 7.4109 6.2272 7.1331 7.0814 1.4824 2.5774 3.2768 2.1590 5.5989 4.7066 1.6334 1.5901 1.7109 11.7104 1.1093 2.8610 2.4743 1.4817 1.2296 1.0734 1.0449 1.0515 1.0894 12.6390 12.2715 11.3190 1.0364 1.0594 1.0630 1.1037 1.1019 1.0975 1.1014
irintensity: 3.6485 0.2918 1.1971 8.4215 3.4656 8.3036 9.1242 0.2854 0.5411 13.3861 0.1100 14.2578 0.0449 9.2221 1.9646 4.0559 57.8195 12.3825 102.1351 18.6510 43.3459 92.6605 0.2241 5.3763 47.7010 5.3443 64.2037 93.6320 235.6867 0.0108 66.1900 41.8758 1.8004 59.1246 0.4968 22.0237 28.0628 24.3960 599.1015 63.7665 104.3060 0.0030 11.5972 1.5502 0.0019 5.7163 1.7585 5.2325
temp: 298.150 k
press: 1.00000 atm
elementType: 8 8 8 8 7 6 6 6 6 6 6 1 1 1 1 1 1 1
symmnumber: 1
zpe: 336918.1 jmol-1
zpe.correction: 0.128325 hartree
zpe.thermalcorrener: 0.138518 hartree
zpe.thermalcorrenthalpy: 0.139462 hartree
zpe.thermalcorrgfe: 0.091212 hartree
zpe.sumelectzpe: -587.636405 hartree
zpe.sumelectthermal: -587.626212 hartree
zpe.sumelectthermalent: -587.625268 hartree
zpe.sumelectthermalfe: -587.673518 hartree
dipole: 1.1614 0.0011 -0.3658
dipole: 1.2176
quadrupole: -40.0076 -78.4601 -65.6767
quadrupole: 0.0099 3.9460 -0.0021
quadrupole: 21.3739 -17.0787 -4.2952 0.0099 3.9460 -0.0021
hfenergy: -587.7647306 hartree
pointgroup: C01 [X(C6H7N1O4)]
dipole: 0.4609941 -0.0029022 -0.1302711 debye
dipolederiv: -1.0503702 0.0063219 0.2215379 0.0017742 -0.2213414 0.0009785 0.4997768 -0.00256 -0.4463126 -0.4743683 -0.2679291 -0.0643335 -0.0010045 -1.13796 -0.077249 -0.0364859 -0.0925304 -0.3343515 -0.4686748 0.2545665 -0.0548343 -0.0130126 -1.1480426 0.0537584 -0.0348215 0.0685598 -0.329846 -0.5341503 0.0060982 -0.1710155 -0.0009282 -0.2393288 0.0116312 0.3092941 0.0067151 -0.9027534 -0.1039453 -0.0150991 -0.0208445 -0.014953 -1.4708052 -0.0197425 -0.0301854 -0.0196583 -0.1630891 -0.3256115 -0.0755949 -0.1263199 -0.0063724 -0.0196042 -0.0131776 -0.1414922 -0.0269502 0.0702773 -0.3238179 0.0862391 -0.1234348 0.0174471 -0.0229125 0.0132258 -0.1401361 0.0272926 0.0717276 0.8135607 -0.1978904 0.1928099 -0.3701625 1.8519647 0.0609461 0.175889 -0.064616 0.2723647 0.8268852 0.2150766 0.1979905 0.3877434 1.8370157 -0.0172978 0.1891708 0.1085813 0.2735984 1.5967887 -0.0152545 -0.0753858 -0.0045237 0.2093481 -0.0163303 -0.8168281 -0.008029 1.3487856 -0.3863118 0.0067471 -0.1262696 0.0081692 0.0060903 0.0041131 -0.1534636 0.0040567 -0.1300376 0.0930966 0.0025131 -0.0075311 -0.014333 0.0426196 0.0457288 -0.0426477 0.072659 -0.0131832 0.0178311 0.0489891 0.0590613 0.0166583 0.0462496 -0.0454265 0.0785272 -0.0579612 0.0485469 0.0164806 -0.0500372 0.0585805 -0.0183136 0.0447201 0.0439608 0.079284 0.0560645 0.0514304 0.0933559 -0.0034247 -0.0087078 0.0144354 0.04579 -0.043835 -0.0439437 -0.0698916 -0.0165805 0.1091476 0.0253452 -0.0020813 -0.013404 0.022789 -0.0882918 0.0097988 -0.0803131 0.0910539 -0.0084505 0.0007073 0.0518122 0.0000997 0.1358766 0.0014335 0.0862515 0.0011668 0.0114768 0.1085542 -0.027374 -0.0010342 0.0106804 0.0175312 0.0855744 0.012012 0.0774141 0.0968924 unknown
polarizability: 99.6369994|-0.228312|87.6540321|5.4944849|0.3429353|61.3518364 unknown
InChI: InChI=1S/C6H7NO4/c1-4(8)11-7-5(9)2-3-6(7)10/h2-3H2,1H3
charge 0 multiplicity 1
18 atoms
O  -1.060054 0.023064 -0.821139
O  0.490301 -2.359994 -0.256909
O  0.543375 2.352476 -0.184838
O  -1.690555 -0.003396 1.461043
N  0.282483 0.00095 -0.355002
C  2.37346 -0.81018 0.347752
C  2.391118 0.743008 0.3710
C  0.969864 -1.219524 -0.111656
C  0.997119 1.197583 -0.074691
C  -2.03443 0.017529 0.277356
C  -3.405197 0.043674 -0.341328
H  2.560635 -1.256164 1.338982
H  3.11406 -1.239054 -0.34858
H  3.140933 1.175516 -0.313136
H  2.588667 1.155054 1.374796
H  -3.540108 -0.833824 -0.996355
H  -4.166046 0.038699 0.451756
H  -3.519923 0.946182 -0.965551
