program: Gaussian 09
title: 000084450
version: EM64L-G09RevD.01
frameworkgroup: C1[X(C8H9NO3)]
method: RPBEPBE
basis: SDD
operation: Freq
keyword: #pfreq=noraman
keyword: PBEPBE/SDD
title: #p freq=noraman PBEPBE/SDD
converged: NO NO NO NO
title: Mulliken charges:
elementType: O O O N C C C C C C C C H H H H H H H H H
charge: -0.358820 -0.225493 -0.178214 0.012621 0.378615 0.514612 -0.595530 0.014084 0.291318 -0.536495 -0.861808 -0.806572 0.242468 0.295454 0.240853 0.240943 0.256225 0.241229 0.223571 0.235003 0.375936
chargesum: 0.00000
title: Mulliken charges with hydrogens summed into heavy atoms:
elementType: O O O N C C C C C C C C
charge: 0.017116 -0.225493 -0.178214 0.012621 0.378615 0.514612 -0.353062 0.014084 0.291318 -0.241041 -0.123787 -0.106769
polarizability: 1.39660304e+02 -2.47094960e-01 1.37452375e+02 -2.42483729e-01 -2.58732893e-01 5.13374359e+01
1716.lowfreq: -14.4781 -6.6449 0.0006 0.0007 0.0009 9.8252 15.3492 25.0045 91.3531
frequency: -6.9604 24.3587 91.3513 154.8431 169.8195 204.3531 207.9172 265.1196 332.3036 345.8695 354.1187 371.7338 394.9161 456.5944 474.2708 522.0631 563.0248 600.9528 681.7716 711.0402 736.5607 761.5381 880.7554 889.5829 938.8240 963.8466 990.1388 1017.4594 1045.2741 1054.0526 1118.5216 1154.4587 1192.8295 1239.7478 1265.9520 1297.3707 1353.6966 1392.7977 1401.4220 1401.9703 1414.9035 1467.7254 1472.6124 1477.0715 1478.6886 1497.3883 1592.5758 1630.6585 2954.0053 2978.0923 3022.9647 3060.2127 3087.7635 3091.8814 3124.0379 3168.1898 3534.2781
redmass: 12.0150 1.0141 4.6462 2.8251 1.2502 5.6533 2.4759 2.7910 4.5612 4.7107 1.1900 8.2742 6.7136 5.7529 4.0938 4.3263 3.1054 3.9640 6.0289 10.6614 5.8767 5.4572 5.1438 1.3407 1.3474 4.6593 1.5861 1.4221 1.5055 1.5531 1.6808 2.3327 6.7542 2.3973 1.4205 4.9256 8.7805 2.4790 1.6196 1.2117 2.8581 1.7062 1.0648 1.1722 1.0455 1.8239 6.2434 6.7627 1.0405 1.0385 1.0983 1.0957 1.0999 1.0942 1.0920 1.0917 1.0648
irintensity: 0.2092 0.9315 0.3399 1.2093 0.1717 0.9940 0.1001 0.9504 4.1344 10.7499 102.2474 3.3264 1.6404 3.9268 16.2964 1.7018 8.7397 12.6897 0.0740 22.6210 7.4311 14.0334 32.7087 18.5900 4.1630 9.3261 2.9780 9.2354 1.2832 21.9034 4.5173 145.0885 279.3810 48.4767 20.2019 30.4672 71.3957 29.3814 86.8159 3.8796 3.9054 30.9473 14.5877 23.5678 15.7648 69.5369 27.1778 0.5829 26.1919 29.9421 17.5183 18.8465 13.1424 8.8187 14.8938 4.7705 41.6713
temp: 298.150 k
press: 1.00000 atm
elementType: 8 8 8 7 6 6 6 6 6 6 6 6 1 1 1 1 1 1 1 1 1
symmnumber: 1
zpe: 413167.8 jmol-1
zpe.correction: 0.157367 hartree
zpe.thermalcorrener: 0.168386 hartree
zpe.thermalcorrenthalpy: 0.169330 hartree
zpe.thermalcorrgfe: 0.119951 hartree
zpe.sumelectzpe: -589.700943 hartree
zpe.sumelectthermal: -589.689924 hartree
zpe.sumelectthermalent: -589.688980 hartree
zpe.sumelectthermalfe: -589.738359 hartree
dipole: -7.2819 2.0978 0.0547
dipole: 7.5782
quadrupole: -80.1578 -59.0919 -70.8586
quadrupole: 0.0230 -0.1183 -0.1290
quadrupole: -10.1217 10.9442 -0.8225 0.0230 -0.1183 -0.1290
hfenergy: -589.8583098 hartree
pointgroup: C01 [X(C8H9N1O3)]
dipole: -2.8466378 -0.8862852 -0.0213508 debye
dipolederiv: -0.2943794 0.5860246 0.0010902 0.3818321 -1.0458272 -0.0016938 0.001905 -0.0039685 -0.354232 -0.6459061 -0.2208729 -0.000899 -0.2348698 -0.8119204 -0.0033936 -0.0007426 -0.0032871 -0.2434882 -0.7727919 0.1669067 0.0015334 0.163708 -0.4901653 -0.0017541 0.0025542 -0.0017596 -0.2102677 1.7430717 0.2704316 0.0004605 0.1839837 1.1249449 0.0061792 -0.0012594 0.0032432 0.1843524 -0.1230519 0.4910383 -0.0009593 0.1240902 0.0686497 -0.0023878 -0.0053384 0.0012592 -0.0583513 -0.1423446 -0.4188035 0.0077591 -0.4024003 0.0971392 -0.0110465 0.0557371 -0.0597428 -0.0332624 0.0968538 -0.0178662 0.0050005 0.2100763 0.1258426 0.0026237 0.0020675 0.0142086 -0.14402 0.3285163 -0.6815274 -0.0044378 -0.1398489 0.8443362 0.0050195 -0.0024394 0.0039974 0.0570551 -0.7188462 -0.3077022 0.0008522 0.0089796 -0.0906147 0.0014396 -0.0018197 0.0065186 0.0512868 0.1904204 0.2871283 -0.0018643 -0.2347519 -0.1770743 -0.0064168 -0.0129762 -0.0038439 -0.1351353 -0.0124895 -0.0431711 0.0013845 -0.0345295 -0.0856478 -0.0010117 0.0034176 -0.0013051 0.0842405 0.0158829 0.0741569 -0.0075802 0.094629 -0.0678514 0.0032436 -0.0719841 0.0706782 0.0627391 -0.1028053 -0.02508 0.0013334 -0.0301805 0.0941691 -0.0029841 0.0060619 -0.0025445 0.1407992 0.1459171 -0.0446702 0.0026977 -0.0064257 0.0456315 -0.0016624 0.0010333 -0.005702 0.1615445 0.0786355 0.0418369 0.0828264 -0.02004 -0.0355463 -0.0747314 0.0402177 -0.1031624 -0.0351863 0.0766753 0.0436498 -0.0843192 -0.0199485 -0.0362974 0.074441 -0.041667 0.1031152 -0.0324774 -0.1040859 -0.0445637 0.0011886 0.0783972 0.1081671 -0.0005079 0.0016556 0.0004022 0.1224183 0.0617803 0.0681575 -0.0199722 0.076325 0.0250865 0.0508728 -0.0572984 0.0936882 -0.0906649 -0.1011822 0.0172069 0.0833877 -0.0727075 0.0549264 0.0408882 0.095255 -0.0088578 0.071806 0.035621 -0.0845611 -0.0685762 -0.0045358 -0.046674 -0.0770126 -0.0140827 -0.1029167 0.0556173 0.2445087 -0.1577192 -0.0009058 -0.1217827 0.2987256 -0.0001049 -0.000297 -0.0000206 0.3452262 unknown
polarizability: 139.6490395|0.2934736|137.4646005|0.1886848|-0.0838185|51.3364746 unknown
InChI: InChI=1S/C8H9NO3/c1-5-3-6(2)8(10)7(4-5)9(11)12/h3-4,10H,1-2H3
charge 0 multiplicity 1
21 atoms
O  0.981184 -2.174271 -0.011435
O  2.534476 1.768708 0.009202
O  2.986633 -0.46349 -0.006397
N  2.159662 0.525285 0.001036
C  -1.270806 -1.207722 0.000233
C  -1.547873 1.256247 0.013393
C  -2.085795 -0.058306 0.01125
C  0.150975 -1.05687 -0.00479
C  0.701894 0.25887 0.000737
C  -0.147495 1.390988 0.012469
C  -1.874453 -2.602454 0.000674
C  -2.452202 2.475531 -0.004813
H  -3.175078 -0.189676 0.018565
H  0.327723 2.376166 0.020379
H  -1.591377 -3.184842 -0.90005
H  -1.580168 -3.189594 0.894711
H  -2.974825 -2.543911 0.007637
H  -2.628096 2.827127 -1.039819
H  -3.438234 2.253965 0.440217
H  -2.006179 3.316028 0.554934
H  0.434336 -3.002379 -0.013331
