program: Gaussian 09
title: 000084812
version: EM64L-G09RevD.01
frameworkgroup: C1[X(C15H9F19O2)]
method: RPBEPBE
basis: SDD
operation: Freq
keyword: #p
keyword: freq=noraman
keyword: PBEPBE/SDD
title: #p freq=noraman PBEPBE/SDD
converged: YES YES NO NO
title: Mulliken charges:
elementType: F F F F F F F F F F F F F F F F F F F O O C C C C C C C C C C C C C C C H H H H H H H H H
charge: -0.120153 -0.108954 -0.112080 -0.128109 -0.115686 -0.114701 -0.135588 -0.117569 -0.126560 -0.139290 -0.119576 -0.166388 -0.154597 -0.119422 -0.118755 -0.116980 -0.122530 -0.112330 -0.112552 -0.257958 -0.253726 0.259450 0.201929 0.254806 0.200837 0.005049 0.247641 0.344840 0.384955 0.409704 -0.532019 -0.334952 0.183469 0.345534 -0.753018 -0.624260 0.269526 0.305358 0.258565 0.250018 0.251460 0.240977 0.215877 0.232847 0.254911
chargesum: 0.00000
title: Mulliken charges with hydrogens summed into heavy atoms:
elementType: F F F F F F F F F F F F F F F F F F F O O C C C C C C C C C C C C C C C
charge: -0.120153 -0.108954 -0.112080 -0.128109 -0.115686 -0.114701 -0.135588 -0.117569 -0.126560 -0.139290 -0.119576 -0.166388 -0.154597 -0.119422 -0.118755 -0.116980 -0.122530 -0.112330 -0.112552 -0.257958 -0.253726 0.259450 0.201929 0.254806 0.200837 0.005049 0.247641 0.344840 0.384955 0.409704 0.042866 0.173631 0.183469 0.345534 -0.044704 -0.136502
polarizability: 1.75779962e+02 -1.21001609e+01 1.93057268e+02 2.91950981e+00 1.27326691e+01 1.61096613e+02
1716.lowfreq: -1.3880 -0.2769 -0.0010 -0.0009 -0.0003 5.6959 7.2794 15.9584 24.0593
frequency: 5.5154 15.7508 23.8681 30.0638 35.3084 40.7413 51.6386 63.3475 71.2811 72.4114 79.6829 92.5241 97.9637 105.8998 120.7082 127.4133 137.0131 149.9201 161.5030 171.8645 178.5032 181.6699 184.1700 199.6975 217.4205 224.7013 232.6014 237.4423 244.0278 251.2239 257.6845 264.2525 268.9540 279.0566 285.7768 288.0451 292.4981 295.8930 301.1685 313.9504 318.6173 327.9831 334.2384 338.8672 357.1814 365.7685 380.6033 390.1096 408.5167 422.7102 450.7164 452.9449 462.1585 465.2701 473.8296 483.7018 489.7228 506.1447 528.7427 545.4099 563.2059 572.8679 578.5535 582.7757 610.6759 632.2224 633.0828 656.6318 669.0850 754.6693 763.4113 785.0825 804.8226 829.8006 887.4981 890.6414 902.2515 937.0364 942.4142 961.7917 984.8730 992.0166 999.4599 1005.6267 1014.1185 1015.6082 1017.8229 1027.9405 1036.3046 1038.1753 1043.5576 1048.1831 1055.4590 1057.5621 1069.0201 1092.5074 1104.3933 1106.4088 1109.9525 1110.5585 1132.7444 1140.4481 1154.1087 1156.0786 1163.6145 1175.4278 1180.4841 1250.2077 1278.1598 1293.3420 1365.9775 1378.5025 1399.9558 1416.4505 1447.1925 1449.5025 1457.7118 1474.8239 1608.7665 1652.3196 2991.5079 3027.4402 3040.6009 3075.5825 3097.1012 3100.5111 3106.2339 3131.1033 3218.2717
redmass: 6.3062 8.1870 6.9571 6.9615 4.5053 13.1588 10.4017 13.9523 7.1405 15.8682 18.3608 17.9537 14.0797 14.9847 7.7616 18.2745 8.0407 14.6192 7.0076 15.7354 7.5973 1.3681 5.4725 8.3478 16.3953 3.8309 17.8040 16.9679 14.6393 17.2985 17.7610 14.7578 16.5566 16.8957 16.8054 16.8077 17.0497 14.7732 18.2873 18.7008 14.7150 15.2436 7.7632 4.8879 4.0287 3.2945 3.4910 9.4888 8.1727 10.2089 8.6146 6.9546 10.3723 14.4317 17.3449 4.1602 17.2748 8.9379 15.7444 16.4592 16.8131 6.9805 13.7199 5.3115 15.7860 1.8377 5.7866 15.9949 3.5244 11.9152 6.2062 2.2233 11.5712 3.2018 11.5235 11.6902 3.9553 6.7902 2.0168 2.4172 12.9609 1.3199 10.6872 10.3728 1.3977 12.9438 10.8562 12.7884 9.7504 9.7082 11.2420 6.7666 1.5641 7.2656 12.1159 10.6799 5.0621 7.7043 3.9913 11.7287 12.6132 9.2324 8.8221 12.1168 11.9428 6.8499 6.4607 1.2271 1.2834 3.1582 1.4390 1.2835 1.1614 1.2561 1.1062 1.0880 1.0443 1.0615 10.0191 5.1083 1.0363 1.0624 1.0624 1.0972 1.0996 1.1008 1.0620 1.1036 1.1157
irintensity: 0.1043 0.0162 0.1634 0.2937 1.4784 0.3893 0.2149 0.1378 3.8928 0.1346 0.1634 0.2271 0.6522 0.8119 1.4018 0.4404 5.0164 1.9470 0.2821 5.3402 1.9437 0.2677 1.0806 1.0101 4.5260 1.3779 6.1266 1.1481 3.1436 1.8380 0.3470 2.3073 0.1624 0.8680 0.2744 0.1320 0.2426 1.3212 0.3030 0.3458 1.3176 2.3560 3.0378 10.2257 7.6692 1.1536 3.4773 5.5403 1.2719 4.7461 8.4730 15.7146 9.7938 0.7300 5.4409 9.5317 0.8339 1.5563 15.8089 17.9887 7.1920 7.3899 6.2060 7.6597 0.8843 27.7665 25.4825 32.0340 7.8425 187.8258 42.1427 10.8868 62.4288 23.2853 77.4862 32.4244 17.9227 36.3192 6.4612 47.0486 47.5062 64.3592 23.1834 28.5203 16.2982 14.5058 31.0988 16.9910 80.5459 72.6081 95.1668 72.2442 25.0707 140.8586 44.1872 200.5432 394.2801 210.4936 113.2168 288.7288 32.4045 27.1670 51.9691 226.1677 97.2946 7.0963 17.7506 9.1083 26.6144 58.0560 40.0206 1.4296 24.7258 11.8279 31.6703 13.6870 13.6768 36.6303 130.3961 2.8338 14.2578 4.4693 22.5476 13.5760 1.4115 22.9483 3.2373 3.2606 5.0771
temp: 298.150 k
press: 1.00000 atm
elementType: 9 9 9 9 9 9 9 9 9 9 9 9 9 9 9 9 9 9 9 8 8 6 6 6 6 6 6 6 6 6 6 6 6 6 6 6 1 1 1 1 1 1 1 1 1
symmnumber: 1
zpe: 630483.6 jmol-1
zpe.correction: 0.240139 hartree
zpe.thermalcorrener: 0.277005 hartree
zpe.thermalcorrenthalpy: 0.277949 hartree
zpe.thermalcorrgfe: 0.168271 hartree
zpe.sumelectzpe: -2621.582137 hartree
zpe.sumelectthermal: -2621.545270 hartree
zpe.sumelectthermalent: -2621.544326 hartree
zpe.sumelectthermalfe: -2621.654005 hartree
dipole: 1.6683 1.7810 -0.8299
dipole: 2.5776
quadrupole: -199.0024 -208.0628 -201.0398
quadrupole: 7.9439 -4.0142 8.7587
quadrupole: 3.6993 -5.3611 1.6618 7.9439 -4.0142 8.7587
hfenergy: -2621.8222751 hartree
pointgroup: C01 [X(C15H9F19O2)]
dipole: 0.3687417 -0.9290991 0.1708531 debye
polarizability: 186.861049|15.5255237|178.5381002|2.1954058|14.1358654|164.5346946 unknown
InChI: InChI=1S/C15H9F19O2/c1-5(2)6(35)36-4-3-7(16,17)9(19,20)11(23,24)13(27,28)12(25,26)10(21,22)8(18,14(29,30)31)15(32,33)34/h1,3-4H2,2H3
charge 0 multiplicity 1
45 atoms
F  -1.875738 1.232829 -2.095872
F  -1.229532 3.262863 -1.303072
F  0.778753 1.581204 -1.982147
F  0.025813 -0.074351 -0.589393
F  -1.846082 2.53121 1.284604
F  -3.537661 2.597192 -0.258965
F  0.566944 1.300927 1.624053
F  0.797246 3.28836 0.513101
F  -1.962247 -0.175133 1.468937
F  3.084292 2.214726 1.544082
F  3.068795 2.486511 -0.722202
F  4.572072 0.396549 0.139607
F  2.773454 -0.249831 -1.112267
F  -4.287555 -1.554653 0.244972
F  -4.303877 0.083251 -1.320918
F  -2.440396 -1.171784 -0.981056
F  -5.413779 0.895069 1.123346
F  -3.980829 1.887213 2.562161
F  -4.291487 -0.337769 2.668528
O  3.432962 -2.844658 0.054959
O  1.364112 -3.526853 0.882628
C  -1.349203 1.897562 -0.963047
C  0.120963 1.32893 -0.758815
C  -2.430146 1.836918 0.196177
C  1.008902 1.897026 0.411875
C  -3.012216 0.473931 0.748148
C  2.575303 1.681121 0.323415
C  3.150289 0.223758 0.184391
C  -3.516439 -0.546948 -0.351308
C  -4.188765 0.743166 1.790896
C  2.771851 -0.756905 1.286286
C  3.617237 -2.044474 1.287466
C  2.219807 -3.552439 -0.038136
C  2.127968 -4.292065 -1.336485
C  3.250329 -4.143971 -2.341817
C  1.016025 -5.053392 -1.536512
H  2.921614 -0.251802 2.258357
H  1.704084 -1.018859 1.208629
H  4.695528 -1.829983 1.309891
H  3.321979 -2.650078 2.162204
H  3.387395 -3.085007 -2.625043
H  4.212649 -4.481017 -1.916896
H  3.039067 -4.731174 -3.251155
H  0.874323 -5.620108 -2.462797
H  0.234698 -5.11326 -0.771012
