program: Gaussian 09
title: 000084415
version: EM64L-G09RevD.01
frameworkgroup: C1[X(C15H19N2)]
method: RPBEPBE
basis: SDD
operation: Freq
keyword: #p
keyword: freq=noraman
keyword: PBEPBE/SDD
title: #p freq=noraman PBEPBE/SDD
converged: YES YES NO NO
title: Mulliken charges:
elementType: N N C C C C C C C C C C C C C C C H H H H H H H H H H H H H H H H H H H
charge: -0.148294 -0.050248 -0.437191 -0.425847 -0.385114 0.455076 -0.656158 -0.355253 -0.341011 -0.118985 -0.119494 -0.226471 -0.229398 -0.183940 -0.182300 -0.245459 -0.151816 0.248895 0.247870 0.298229 0.253499 0.250561 0.226184 0.194785 0.246205 0.248436 0.243867 0.201926 0.287389 0.282561 0.243951 0.235901 0.276673 0.276724 0.250497 0.287751
chargesum: 1.00000
title: Mulliken charges with hydrogens summed into heavy atoms:
elementType: N N C C C C C C C C C C C C C C C
charge: -0.148294 -0.050248 0.059573 0.125881 0.091632 0.455076 0.033268 -0.111386 -0.139085 0.168404 0.163067 0.017480 0.006503 0.092733 0.094424 0.005037 0.135935
polarizability: 4.51818602e+02 -3.95079786e-01 1.90713805e+02 5.93700018e+00 -1.45626804e+00 9.22899644e+01
1716.lowfreq: -6.8203 -1.4123 -0.0006 -0.0004 0.0005 6.1174 22.0962 29.5464 48.5073
frequency: 21.7046 29.3633 48.4048 65.7779 94.2722 107.3105 113.3768 196.9096 205.4331 250.3507 264.7865 298.3615 385.6148 391.5730 400.2078 408.6543 413.8657 467.7880 502.4505 519.1280 533.6892 595.5826 613.2196 641.6327 679.8948 690.8353 724.8160 759.6468 765.2525 785.6418 794.5553 812.1056 815.5531 846.1807 886.1512 894.6197 921.1046 954.1913 965.3024 977.6931 978.8729 994.1364 1007.5029 1008.2829 1009.3952 1032.5828 1042.8830 1051.3235 1073.2714 1093.9726 1099.4240 1141.5846 1153.5828 1175.2869 1181.7819 1192.0896 1206.4389 1214.4255 1227.5233 1262.8354 1298.0644 1312.9498 1339.8316 1344.3422 1346.1736 1351.9927 1375.3188 1381.7166 1386.9027 1392.9235 1449.7322 1457.6847 1472.5339 1475.0348 1476.4109 1483.0482 1490.1882 1492.9982 1499.5762 1544.2174 1578.5402 1606.3625 1618.5984 2973.8693 2987.8384 3008.4749 3039.1828 3059.0280 3064.2650 3084.9621 3099.4832 3118.8693 3126.8210 3144.6202 3151.7135 3170.4748 3176.8076 3181.3611 3181.5101 3189.6033 3198.4211 3206.7115
redmass: 3.9040 4.0608 3.4245 3.8106 4.3459 3.3527 3.2353 3.2097 1.2611 3.7213 2.1493 3.4049 2.2192 3.7929 2.7609 3.0141 3.2044 3.5565 3.2614 3.1447 3.2523 4.6856 6.3819 6.3254 2.0147 1.8319 3.4927 1.8594 1.6815 1.2191 1.3648 1.2678 2.8876 1.2788 1.4443 2.2292 1.4669 4.1050 1.4093 1.9090 2.4290 1.3410 3.6347 2.0250 2.1125 2.2400 2.2591 1.8450 1.9535 1.6253 1.7416 1.8272 4.0417 1.1948 1.0714 1.5065 1.1321 1.1994 1.6948 1.5118 1.2951 1.2021 1.4015 1.2240 1.4463 1.4500 2.5235 6.0962 1.5242 1.2264 2.2940 1.4983 1.1278 1.3985 1.4915 1.1473 1.9844 1.2747 1.0988 5.0553 5.7887 5.7279 5.1775 1.0658 1.0368 1.0630 1.0614 1.0993 1.0966 1.0998 1.1009 1.1064 1.0860 1.0875 1.0935 1.0937 1.0894 1.0899 1.1000 1.0952 1.0987 1.1036
irintensity: 0.0236 0.4374 0.2497 0.5255 2.6439 1.6745 0.2573 2.7178 1.0066 1.3464 0.3741 0.7920 0.4329 4.0569 0.1363 1.9537 5.4831 20.5041 11.9194 0.9626 5.7045 3.4756 0.0531 0.1797 61.5443 29.0252 25.8229 74.1458 53.3731 1.8702 9.0675 4.6178 26.6624 0.4655 1.4714 4.6019 22.8868 24.8178 0.5782 1.1333 0.1869 0.4719 32.6780 18.7775 23.7039 12.1692 1.4205 4.2341 14.9025 25.8194 4.6177 8.2225 158.0124 9.3712 0.6981 26.2585 6.4393 25.6026 28.3865 25.0016 8.1625 17.4634 8.5113 51.1499 25.2553 2.2876 2.6802 2.4509 4.3384 22.8770 0.8449 45.7926 23.2115 18.9366 18.4931 32.6917 65.7813 24.8463 36.6549 4.5867 11.9286 44.0607 146.9237 18.0240 13.5059 41.0370 12.1399 0.3686 9.9892 39.4285 25.5072 3.4445 9.9378 2.6268 10.5015 18.9772 7.9063 0.2274 15.4183 0.3015 0.6165 4.7940
temp: 298.150 k
press: 1.00000 atm
elementType: 7 7 6 6 6 6 6 6 6 6 6 6 6 6 6 6 6 1 1 1 1 1 1 1 1 1 1 1 1 1 1 1 1 1 1 1
symmnumber: 1
zpe: 809449.3 jmol-1
zpe.correction: 0.308303 hartree
zpe.thermalcorrener: 0.323953 hartree
zpe.thermalcorrenthalpy: 0.324897 hartree
zpe.thermalcorrgfe: 0.263310 hartree
zpe.sumelectzpe: -691.008170 hartree
zpe.sumelectthermal: -690.992520 hartree
zpe.sumelectthermalent: -690.991576 hartree
zpe.sumelectthermalfe: -691.053164 hartree
dipole: 8.8465 0.9815 -0.3541
dipole: 8.9078
quadrupole: -35.1175 -74.4083 -103.3439
quadrupole: -5.1298 2.9991 -0.7792
quadrupole: 35.8390 -3.4517 -32.3873 -5.1298 2.9991 -0.7792
hfenergy: -691.3164732 hartree
pointgroup: C01 [X(C15H19N2)]
dipole: 3.4898561 0.286217 -0.145813 debye
polarizability: 451.5991631|-7.6852219|190.8913012|5.6648553|-2.7848868|92.331907 unknown
InChI: InChI=1S/C15H19N2/c1-2-17(15-9-5-3-6-10-15)14-13-16-11-7-4-8-12-16/h3-12H,2,13-14H2,1H3
charge 1 multiplicity 1
36 atoms
N  -1.18194 1.086841 0.638791
N  2.307452 0.00682 -0.426135
C  0.225927 0.782549 0.796779
C  0.914642 0.490809 -0.596888
C  -1.598355 2.511516 0.68537
C  -2.102756 0.062507 0.291836
C  -1.548559 3.250893 -0.672438
C  -3.429253 0.378829 -0.132394
C  -1.738067 -1.31828 0.371554
C  2.525163 -1.323396 -0.109352
C  3.366129 0.896864 -0.456126
C  -4.345577 -0.642713 -0.447815
C  -2.666536 -2.330309 0.052746
C  3.81526 -1.789445 0.17075
C  4.669365 0.467382 -0.183485
C  -3.976598 -2.005234 -0.36308
C  4.909699 -0.892249 0.137039
H  0.383718 -0.098466 1.450398
H  0.730323 1.638872 1.277309
H  0.330703 -0.284626 -1.121547
H  0.927686 1.403767 -1.212159
H  -2.617441 2.557675 1.106497
H  -0.94441 3.02692 1.412981
H  -0.514947 3.333204 -1.056751
H  -2.159894 2.739964 -1.435824
H  -1.937578 4.278075 -0.554928
H  -3.755223 1.418131 -0.221916
H  -0.750715 -1.620357 0.737893
H  1.648286 -1.974777 -0.12019
H  3.125818 1.930703 -0.71334
H  -5.357026 -0.369402 -0.766431
H  -2.365757 -3.380041 0.14061
H  3.955984 -2.847189 0.405524
H  5.485172 1.192758 -0.226922
H  -4.693953 -2.79298 -0.610931
H  5.92296 -1.242313 0.35067
