program: Gaussian 09
title: 000084393
version: EM64L-G09RevD.01
frameworkgroup: C1[X(C8H8Cl2S)]
method: RPBEPBE
basis: SDD
operation: Freq
keyword: #p
keyword: freq=noraman
keyword: PBEPBE/SDD
title: #p freq=noraman PBEPBE/SDD
converged: YES YES NO NO
title: Mulliken charges:
elementType: Cl Cl S C C C C C C C C H H H H H H H H
charge: -0.052606 -0.050211 0.223001 -0.224109 -0.578036 -0.201690 -0.220121 -0.549525 -0.197612 -0.194309 -0.095927 0.285860 0.267584 0.256184 0.264243 0.275514 0.271508 0.259531 0.260721
chargesum: 0.00000
title: Mulliken charges with hydrogens summed into heavy atoms:
elementType: Cl Cl S C C C C C C C C
charge: -0.052606 -0.050211 0.223001 -0.224109 -0.024592 0.054495 0.044122 -0.002503 0.061919 0.066412 -0.095927
polarizability: 1.92123144e+02 -4.71220563e+00 1.03590769e+02 -7.27822556e+00 -2.41866506e+00 6.81242325e+01
1716.lowfreq: -6.8113 0.0023 0.0030 0.0038 5.0248 7.9884 14.7934 24.8838 45.6893
frequency: 10.7541 24.5969 45.5634 89.3342 134.5819 198.8460 228.7898 297.1692 315.2115 326.9492 396.0852 410.8439 489.2472 513.4935 597.0551 619.6613 621.6561 704.2692 715.9328 825.2746 831.4301 868.4635 937.0135 952.5749 967.9128 991.5313 1046.1378 1067.5625 1074.0051 1097.1557 1114.8438 1176.6804 1178.4256 1279.5963 1281.5379 1299.0597 1355.7457 1377.2192 1431.3823 1439.0702 1455.0313 1574.0531 1577.0576 3017.1865 3051.3526 3099.0874 3136.3838 3146.5018 3155.0172 3172.5611 3177.6870
redmass: 7.1639 4.3049 9.1019 9.9062 8.4074 7.9433 2.5987 7.3947 7.5687 5.0592 4.0325 2.9124 3.6676 6.1544 5.8347 5.5217 3.9167 3.9322 7.0728 1.3468 1.3283 1.6833 1.4817 1.3326 1.3664 5.7013 2.4319 5.9956 1.9864 1.3637 1.0405 1.1769 1.2030 1.2318 1.2272 1.2055 4.7491 4.0361 1.0903 1.1019 2.2064 6.3948 7.9393 1.0583 1.0579 1.1053 1.1100 1.0894 1.0892 1.0963 1.0975
irintensity: 0.0423 3.7031 1.2649 0.9705 0.2978 1.1079 1.2191 0.7681 7.3606 0.9729 1.0168 0.0697 27.5149 21.9383 10.8812 3.9278 9.9407 0.9999 9.2538 32.6005 29.8297 50.1084 3.6484 0.3246 0.0633 68.6987 7.5349 25.3428 21.3956 8.7125 0.6093 4.9793 2.2956 12.0601 22.1142 13.6849 0.5319 7.9015 10.9410 8.3584 83.1646 12.7165 0.9796 10.7049 22.3076 6.4935 10.3354 2.8560 1.2972 4.4840 1.2047
temp: 298.150 k
press: 1.00000 atm
elementType: 17 17 16 6 6 6 6 6 6 6 6 1 1 1 1 1 1 1 1
symmnumber: 1
zpe: 358249.2 jmol-1
zpe.correction: 0.136450 hartree
zpe.thermalcorrener: 0.148013 hartree
zpe.thermalcorrenthalpy: 0.148957 hartree
zpe.thermalcorrgfe: 0.094606 hartree
zpe.sumelectzpe: -1627.013085 hartree
zpe.sumelectthermal: -1627.001523 hartree
zpe.sumelectthermalent: -1627.000578 hartree
zpe.sumelectthermalfe: -1627.054930 hartree
dipole: -0.3750 2.0770 1.5911
dipole: 2.6431
quadrupole: -103.2429 -77.1085 -87.6451
quadrupole: 7.6166 4.6407 -1.2461
quadrupole: -13.9107 12.2236 1.6871 7.6166 4.6407 -1.2461
hfenergy: -1627.1495354 hartree
pointgroup: C01 [X(C8H8Cl2S1)]
dipole: 0.1118808 0.6331268 -0.817295 debye
dipolederiv: -0.5090548 -0.0984668 0.0749405 -0.2101668 -0.2707015 0.0659968 0.1215844 0.0557925 -0.2009067 -0.8894606 -0.0110736 0.148834 -0.0165083 -0.1247669 0.0039229 0.1899741 0.0044713 -0.1022821 -0.1058219 0.0397495 -0.0854763 0.1549995 -0.146437 -0.0183877 -0.2209741 -0.0161301 0.0212047 0.5467679 -0.0005838 -0.0460698 -0.0190694 -0.0387007 0.0194773 -0.0107183 0.0139376 -0.1738348 -0.0501567 -0.0359493 0.211455 -0.1652826 0.0394486 0.0102757 0.4556861 0.0219071 0.1818266 -0.1373918 -0.0732355 -0.0312625 0.080706 0.0431997 0.0003111 0.0295512 0.0223358 -0.1070348 -0.1503149 0.0864514 -0.0270027 -0.0931171 0.0484359 -0.0008943 -0.0200543 -0.0236459 -0.0941533 0.5652008 0.2218939 -0.1218119 0.2696863 0.3478964 -0.1048886 -0.4099587 -0.0936043 0.1794938 -0.3527972 0.0860632 0.0363812 0.0492997 -0.000552 -0.0097842 0.0480094 -0.0200554 -0.1107742 -0.3431789 -0.1057501 0.0424855 -0.0662343 -0.008724 0.0092788 0.0420801 0.0218048 -0.1076872 1.2756388 0.0224055 -0.2755633 0.0209088 0.1382014 -0.0101951 -0.3049605 -0.0103443 -0.0004204 0.03668 0.0314051 -0.0436546 0.0489243 -0.0173589 -0.080954 -0.1159612 -0.0567397 -0.0621578 -0.034153 -0.0871081 0.0354507 -0.016912 0.0104897 0.0804932 0.0124049 0.0539075 -0.0017459 0.0494464 0.0860944 0.0297963 0.0732879 -0.0043854 -0.0099526 0.032894 -0.0096494 0.1379387 0.064958 -0.0733631 0.0286507 -0.0587063 0.0004768 0.0091786 0.0264682 0.0144378 0.1415641 0.056653 -0.0721641 0.0295531 -0.0371729 -0.0754282 -0.0359314 0.0977264 -0.0669045 0.0342071 -0.0951218 -0.0209052 -0.0520514 -0.01688 0.0559354 0.0667772 -0.028689 0.0812898 -0.0596633 0.0381709 -0.0625737 0.0233399 -0.0603323 -0.0021583 0.0131998 0.0254132 0.0175721 0.1621191 0.0339356 0.0671103 0.0220054 0.0625693 0.0051289 -0.0079234 0.0295242 -0.0103829 0.1623065 unknown
polarizability: 191.3570399|3.6949868|102.5782424|-12.2051777|-6.8503419|69.9028632 unknown
InChI: InChI=1S/C8H8Cl2S/c9-5-6-11-8-3-1-7(10)2-4-8/h1-4H,5-6H2
charge 0 multiplicity 1
19 atoms
Cl -5.080016 -0.515355 0.090836
Cl 4.552917 0.021127 -0.557562
S  -1.747567 -0.126806 0.93404
C  0.040089 -0.076446 0.469342
C  -2.495913 0.206031 -0.791492
C  0.702877 1.163161 0.301051
C  0.762569 -1.2856 0.336249
C  -3.90877 0.754597 -0.676812
C  2.079503 1.200284 -0.017896
C  2.142472 -1.262931 0.025786
C  2.77576 -0.017676 -0.151238
H  -2.467021 -0.728714 -1.373696
H  -1.852996 0.961032 -1.279804
H  0.150708 2.09944 0.434162
H  0.249744 -2.242085 0.476864
H  -3.965899 1.64018 -0.026609
H  -4.333967 0.971047 -1.669374
H  2.598139 2.154422 -0.147601
H  2.706969 -2.193908 -0.076845
