program: Gaussian 09
title: 000084352
version: EM64L-G09RevD.01
frameworkgroup: C1[X(C9H13N)]
method: RPBEPBE
basis: SDD
operation: Freq
keyword: #pfreq=noraman
keyword: PBEPBE/SDD
title: #p freq=noraman PBEPBE/SDD
converged: YES YES NO NO
title: Mulliken charges:
elementType: N C C C C C C C C C H H H H H H H H H H H H H
charge: -0.304014 -0.479684 0.422296 -0.318312 -0.384707 -0.436292 -0.689709 -0.222507 -0.222052 -0.244166 0.222613 0.194225 0.250890 0.210855 0.177624 0.272554 0.230350 0.204416 0.231363 0.212036 0.223141 0.223198 0.225881
chargesum: 0.00000
title: Mulliken charges with hydrogens summed into heavy atoms:
elementType: N C C C C C C C C C
charge: -0.053124 -0.062846 0.422296 0.070167 -0.112153 -0.205942 -0.041894 0.000635 0.001146 -0.018285
polarizability: 1.36901996e+02 -2.18311716e+00 1.03049192e+02 7.32746563e+00 3.06203536e+00 6.16117159e+01
1716.lowfreq: -13.2058 -8.5360 -0.0009 -0.0007 -0.0006 4.4847 35.4160 72.7420 83.3987
frequency: 35.1112 72.7002 83.3598 126.3268 211.7710 246.3946 270.8971 311.3408 405.0856 434.2238 492.5570 585.8218 616.1627 677.4442 706.9462 747.3591 805.5272 811.2190 858.3827 905.3775 913.9933 978.7070 983.4185 989.6860 999.1778 1023.9260 1035.4941 1078.1277 1113.1254 1138.0973 1152.3490 1169.1589 1179.8974 1212.0156 1225.2219 1265.1962 1300.3475 1331.6370 1371.6574 1387.5359 1393.4415 1439.3638 1445.9290 1471.1949 1474.0419 1480.5563 1484.8896 1499.3501 1593.2769 1614.7967 2848.3418 2856.5980 2965.3380 2979.5129 2994.0069 3071.9754 3092.5127 3112.1563 3122.6444 3136.0788 3149.9430 3161.8614 3434.0645
redmass: 3.1828 1.8081 3.1579 2.6089 2.6219 1.2714 3.0894 3.9397 2.8424 2.7587 2.9973 4.8919 6.2726 1.3903 1.9327 1.5363 3.7758 1.1143 1.2489 1.6825 1.3354 1.4898 1.4668 5.8245 1.3855 2.2315 2.7986 1.5941 1.9601 1.5703 3.0325 1.0623 1.1088 2.3879 1.3622 1.1827 1.3712 1.2861 1.9018 2.0868 1.5922 2.1134 1.1938 1.0576 1.2750 1.2150 1.4409 1.0880 6.1663 6.1432 1.0718 1.0715 1.0856 1.0376 1.0858 1.0981 1.1002 1.0865 1.0866 1.0923 1.0952 1.1010 1.0744
irintensity: 0.2683 2.2380 0.3801 2.5998 3.0011 1.7549 0.9717 0.1101 0.2640 3.7101 9.7390 1.8393 0.7733 87.6723 48.7166 67.0426 3.5719 4.0552 0.0725 1.3793 3.7584 7.5567 6.8443 0.2828 2.5488 15.5524 5.1955 10.7389 5.4548 1.6233 59.6184 0.6621 1.0448 3.4451 6.5948 2.3048 19.6030 9.7331 0.1551 14.6035 10.0912 9.6862 32.9166 22.1552 22.6058 0.3763 5.0719 4.4603 0.6136 7.2756 41.6470 188.3741 28.2430 29.3770 36.3661 55.9406 38.8251 8.9473 0.9061 29.5024 28.2822 21.9695 0.6596
temp: 298.150 k
press: 1.00000 atm
elementType: 7 6 6 6 6 6 6 6 6 6 1 1 1 1 1 1 1 1 1 1 1 1 1
symmnumber: 1
zpe: 520822.1 jmol-1
zpe.correction: 0.198371 hartree
zpe.thermalcorrener: 0.208470 hartree
zpe.thermalcorrenthalpy: 0.209414 hartree
zpe.thermalcorrgfe: 0.161862 hartree
zpe.sumelectzpe: -404.736050 hartree
zpe.sumelectthermal: -404.725951 hartree
zpe.sumelectthermalent: -404.725007 hartree
zpe.sumelectthermalfe: -404.772559 hartree
dipole: 0.7391 -0.7749 -0.5205
dipole: 1.1906
quadrupole: -55.0711 -57.5996 -63.0808
quadrupole: -1.4092 0.6327 0.3215
quadrupole: 3.5127 0.9842 -4.4969 -1.4092 0.6327 0.3215
hfenergy: -404.9344211 hartree
pointgroup: C01 [X(C9H13N1)]
dipole: 0.312404 0.3489488 -0.0081746 debye
dipolederiv: -0.8958572 -0.0034032 -0.0232818 -0.0504497 -0.4537802 0.2094307 -0.0306959 0.1809994 -0.2948817 0.3813636 -0.0488367 0.1291426 0.0551403 0.4099581 -0.0803569 0.3546004 -0.0907224 0.3057636 0.1998371 0.0115198 -0.1072005 -0.0041245 -0.0555347 0.0306633 -0.2160964 0.0044541 -0.0027153 0.6812962 0.0843033 -0.1028754 0.0307962 0.3936623 -0.0196203 -0.2467331 -0.008276 0.2070741 -0.1199214 -0.0831033 0.0236235 -0.1156646 -0.0395122 -0.032257 0.0813117 -0.0363569 -0.1553412 -0.1671283 0.0128409 -0.0163322 0.0271657 0.0173873 -0.1153147 -0.01422 -0.11424 -0.1086557 -0.0939479 0.0456467 -0.0587433 0.0229257 0.0473294 0.0590417 -0.0562878 0.0443825 0.0323803 -0.0174808 0.0252654 -0.0445498 0.0362769 0.0635313 -0.1204929 -0.0530293 -0.1243276 -0.0813582 0.0246662 -0.0831494 -0.0059756 -0.0998332 0.0226856 -0.0641617 0.0165848 -0.0682164 -0.1210541 0.0412197 0.0115176 -0.0597614 0.0268786 -0.0981721 -0.045412 -0.0593646 -0.0418797 -0.1395685 -0.0298423 0.0164584 0.0824915 0.046487 0.0164378 -0.1039015 0.0145058 -0.0606486 -0.1056106 -0.0599674 -0.0071866 -0.0152037 0.0287889 -0.2506626 0.1367788 -0.083382 0.0815398 0.0011262 0.1513691 0.0270213 -0.0221251 0.0719715 0.1701955 -0.1646703 -0.0041407 -0.0794206 0.0353669 0.0109539 -0.0089274 -0.0238405 0.0093864 -0.0029371 -0.1145359 0.0529749 -0.103267 -0.1422473 -0.1519209 -0.0359207 0.0152737 -0.1867205 -0.2398468 0.115776 0.0823936 0.0828311 0.0063808 0.0800622 0.097577 -0.0181545 0.1111229 0.0370383 0.0388864 -0.0200075 0.0436139 0.1273253 0.0739842 -0.0666645 0.0503876 -0.0452398 -0.0450644 0.1088991 0.0361768 0.1108197 0.0871777 0.0935014 0.0286807 0.0366208 0.0182725 -0.0019136 -0.1353466 -0.0262767 -0.1007668 -0.1171704 0.1074173 -0.0832421 0.0185634 -0.0217623 -0.1286739 0.069881 -0.0128335 0.0549516 0.062933 -0.2042283 0.0139488 0.0470905 -0.0025875 0.1041931 0.0104969 0.0791837 0.0067964 0.0612619 0.0575015 -0.0403366 0.0384881 -0.0584675 -0.0565175 0.1193671 0.0441632 0.1191559 0.0839833 -0.0378933 0.110407 -0.0175871 0.1230025 -0.0086572 0.0583092 -0.0184335 0.0585113 0.1326785 -0.1249844 -0.0244163 0.0739492 -0.0233656 0.0988536 0.0385397 0.0796062 0.0400666 0.1251514 unknown
polarizability: 136.6057269|-4.9931968|92.3213974|-7.67128|-18.2356926|72.635779 unknown
InChI: InChI=1S/C9H13N/c1-2-10-8-9-6-4-3-5-7-9/h3-7,10H,2,8H2,1H3
charge 0 multiplicity 1
23 atoms
N  1.977573 -0.043358 0.115422
C  0.991529 0.488701 -0.848618
C  -0.44439 0.280925 -0.377724
C  3.384302 0.028589 -0.332699
C  -0.813625 -0.898738 0.318067
C  -1.439144 1.25264 -0.651802
C  4.331868 -0.526169 0.744362
C  -2.151295 -1.103838 0.723292
C  -2.779795 1.047137 -0.252051
C  -3.14068 -0.133326 0.437654
H  1.148404 -0.054978 -1.804425
H  1.144912 1.572364 -1.084472
H  1.852058 0.368568 1.050902
H  3.477669 -0.576608 -1.256728
H  3.698212 1.069408 -0.603194
H  -0.036123 -1.638279 0.537466
H  -1.16379 2.17488 -1.179475
H  4.273954 0.07217 1.67407
H  4.064124 -1.568549 0.990814
H  5.379898 -0.503266 0.395294
H  -2.423502 -2.020046 1.260316
H  -3.537783 1.807837 -0.471885
H  -4.178377 -0.292965 0.752118
