program: Gaussian 09
title: 000084346
version: EM64L-G09RevD.01
frameworkgroup: C1[X(C9H8S)]
method: RPBEPBE
basis: SDD
operation: Freq
keyword: #p
keyword: freq=noraman
keyword: PBEPBE/SDD
title: #p freq=noraman PBEPBE/SDD
converged: YES YES NO NO
title: Mulliken charges:
elementType: S C C C C C C C C C H H H H H H H H
charge: 0.251540 0.600944 -0.416498 0.465918 -0.590075 -0.256746 -0.365602 -0.274122 -0.811558 -0.518503 0.243467 0.241806 0.231674 0.252106 0.229998 0.230450 0.224032 0.261169
chargesum: 0.00000
title: Mulliken charges with hydrogens summed into heavy atoms:
elementType: S C C C C C C C C C
charge: 0.251540 0.600944 -0.416498 0.465918 -0.346608 -0.014940 -0.133927 -0.022016 -0.127078 -0.257334
polarizability: 1.65249042e+02 4.97197068e+00 1.13891970e+02 -1.32030934e-02 3.38666189e-03 4.75415576e+01
1716.lowfreq: -6.0740 -0.0014 0.0017 0.0021 4.2039 11.5915 48.2857 122.1959 195.2122
frequency: 48.1533 122.1944 195.2093 256.7365 302.0863 359.5131 416.8934 446.3024 470.1357 525.6784 593.9618 611.1458 655.6961 703.6742 734.4636 774.7673 800.4323 810.3382 881.1043 909.0777 924.2506 954.7727 1001.0633 1031.4186 1049.0734 1088.8653 1153.2824 1167.4655 1238.7831 1261.2388 1315.1224 1383.5741 1398.3485 1423.2570 1447.7650 1469.8203 1477.6670 1521.9992 1570.5728 1616.0226 2975.8837 3053.8536 3083.6085 3123.9253 3126.6240 3154.1941 3171.5452 3233.9367
redmass: 1.0479 4.0690 4.0596 3.4881 4.1866 5.0166 3.1226 4.2678 3.4981 7.4544 2.9717 6.4370 7.0315 1.6446 6.6865 2.0484 4.8688 1.3244 1.2895 1.4987 2.6861 1.3416 1.4956 4.7071 1.5563 1.1810 1.3923 1.4873 1.9809 1.5004 2.0906 5.3328 1.2572 3.7470 3.3639 1.0453 1.1475 5.1325 6.3616 6.6021 1.0372 1.0977 1.0987 1.0890 1.0913 1.0963 1.0918 1.0999
irintensity: 0.5056 1.2302 3.1452 1.5289 0.1368 2.9761 3.0681 0.3273 16.7506 0.1799 0.0601 0.4056 4.1700 60.0866 8.5339 17.5415 9.1247 42.1385 1.5789 19.4243 0.3520 1.4191 5.6331 17.5962 14.0149 12.1480 8.7872 0.9766 6.9740 2.3936 2.2988 0.5411 11.0080 5.8679 27.7082 13.2074 18.9089 2.7375 1.5457 4.7946 41.8954 22.3270 18.6218 10.9437 13.6679 13.7593 4.7027 1.3881
temp: 298.150 k
press: 1.00000 atm
elementType: 16 6 6 6 6 6 6 6 6 6 1 1 1 1 1 1 1 1
symmnumber: 1
zpe: 365073.3 jmol-1
zpe.correction: 0.139049 hartree
zpe.thermalcorrener: 0.147597 hartree
zpe.thermalcorrenthalpy: 0.148541 hartree
zpe.thermalcorrgfe: 0.104984 hartree
zpe.sumelectzpe: -745.121111 hartree
zpe.sumelectthermal: -745.112563 hartree
zpe.sumelectthermalent: -745.111619 hartree
zpe.sumelectthermalfe: -745.155177 hartree
dipole: -1.0393 0.7252 0.0016
dipole: 1.2673
quadrupole: -58.1558 -58.5297 -71.2771
quadrupole: 3.0533 -0.0063 0.0004
quadrupole: 4.4984 4.1245 -8.6230 3.0533 -0.0063 0.0004
hfenergy: -745.2601601 hartree
pointgroup: C01 [X(C9H8S1)]
dipole: 0.3757086 0.3274919 -0.0137347 debye
dipolederiv: -0.2790819 0.0377581 -0.0033044 -0.1431703 -0.2441092 0.0147291 0.0048239 0.0156127 0.0956246 0.0956452 0.008631 -0.0003368 -0.2269067 -0.1447476 0.0092046 0.0107344 0.0101865 0.0796731 0.5080499 0.1451089 -0.0036368 0.1940753 -0.1466991 0.0008759 -0.0058526 0.0006378 -0.1475883 0.3767496 0.135402 -0.0049696 0.1139601 -0.0531387 0.0013953 -0.0070654 0.0007603 -0.0286902 -0.149232 -0.068831 0.003397 0.0466954 0.1039209 -0.0131284 -0.0016449 -0.0134103 -0.1908187 -0.1149912 -0.0575957 0.0026279 -0.0839305 0.1153836 -0.0107104 0.0040579 -0.0105056 -0.106759 -0.1142474 -0.0388647 0.0019059 -0.0607629 0.0482277 -0.0112157 0.0033931 -0.010937 -0.2000006 -0.1522215 -0.2065365 0.0094095 -0.0915936 -0.0655234 -0.0051548 0.0041169 -0.0057134 -0.171678 -0.1305914 -0.0535454 0.0018835 0.0067221 0.0818509 -0.0002624 0.0033504 0.0001582 0.072773 -0.1932854 0.0461047 -0.0015109 0.1577702 0.4854984 -0.0349843 -0.0067502 -0.0355222 -0.3041212 0.0559074 -0.0313914 0.0007605 -0.0560992 -0.0961339 0.0111403 0.0018031 0.0110339 0.1588227 0.0771289 -0.0566315 0.0021434 -0.010689 -0.0727804 0.0106342 -0.0000034 0.0104951 0.1625018 -0.0621421 0.1097654 -0.0059902 0.0939662 0.0142234 0.0067311 -0.0055484 0.0069731 0.1556497 0.0936859 -0.0441698 0.001522 0.0442591 -0.069691 0.0119771 -0.0024108 0.0115398 0.1920891 -0.0395198 -0.006311 -0.0789051 0.0197008 0.0713141 0.0813841 -0.1403196 0.0434734 -0.0500301 -0.0414616 -0.0012672 0.0793018 0.0276525 0.0633292 -0.0880274 0.1383003 -0.0509989 -0.0416395 0.0710463 0.0440125 -0.0015715 -0.0814448 -0.1490465 0.0080187 0.0021777 0.0088698 0.1075851 -0.0014392 0.0383617 -0.0027262 0.0497954 0.0581216 0.0073929 -0.0031626 0.0073467 0.2166066 unknown
polarizability: 165.7155513|0.6786641|113.2894818|0.4761156|-2.9660698|47.6775365 unknown
InChI: InChI=1S/C9H8S/c1-7-2-3-9-8(6-7)4-5-10-9/h2-6H,1H3
charge 0 multiplicity 1
18 atoms
S  -2.490653 -1.163533 0.047348
C  -0.495118 0.638038 -0.024938
C  -0.716834 -0.773842 0.037581
C  1.930357 0.225497 0.004582
C  0.842928 1.121231 -0.040405
C  0.354801 -1.688414 0.083575
C  1.667997 -1.178216 0.066575
C  -1.735804 1.393485 -0.064507
C  3.364583 0.727111 -0.012635
C  -2.864221 0.604504 -0.034314
H  1.024309 2.201836 -0.087618
H  0.179269 -2.767961 0.131746
H  2.513262 -1.876339 0.102137
H  -1.772891 2.484839 -0.113613
H  3.916669 0.397096 0.887462
H  3.914922 0.34002 -0.890948
H  3.408291 1.829212 -0.048277
H  -3.909266 0.910036 -0.052851
