program: Gaussian 09
title: 000084462
version: EM64L-G09RevD.01
frameworkgroup: C1[X(C20H17ClO)]
method: RPBEPBE
basis: SDD
operation: Freq
keyword: #p
keyword: freq=noraman
keyword: PBEPBE/SDD
title: #p freq=noraman PBEPBE/SDD
converged: YES YES NO NO
title: Mulliken charges:
elementType: Cl O C C C C C C C C C C C C C C C C C C C C H H H H H H H H H H H H H H H H H
charge: -0.099877 -0.262748 -0.452433 0.418659 0.408742 0.413717 -0.353220 -0.343121 -0.382149 -0.346505 -0.349355 -0.382743 -0.376823 -0.375821 0.317506 -0.242323 -0.244320 -0.244855 -0.243493 -0.239799 -0.240467 -0.537577 0.261641 0.270009 0.260880 0.271841 0.272799 0.261402 0.252157 0.242857 0.227967 0.228950 0.229269 0.227793 0.229386 0.229205 0.224166 0.221812 0.246872
chargesum: 0.00000
title: Mulliken charges with hydrogens summed into heavy atoms:
elementType: Cl O C C C C C C C C C C C C C C C C C C C C
charge: -0.099877 -0.262748 -0.452433 0.418659 0.408742 0.413717 -0.091579 -0.073112 -0.121270 -0.074664 -0.076556 -0.121341 -0.124667 -0.132964 0.317506 -0.014356 -0.015370 -0.015586 -0.015700 -0.010413 -0.011262 0.155273
polarizability: 2.80012960e+02 2.40325393e+00 2.39965745e+02 2.09033355e+00 -1.68778038e+00 1.75816925e+02
1716.lowfreq: -5.2550 -0.0011 -0.0009 -0.0007 3.8288 6.8459 26.1166 30.2893 41.4170
frequency: 26.0045 30.2273 41.4064 53.4872 67.6687 78.8291 109.7815 138.2924 153.3184 180.8767 201.9360 233.7057 242.6835 259.1682 264.7955 281.4369 299.7147 321.3237 364.8914 400.4017 402.9278 413.9127 448.8643 482.6534 501.3807 526.4050 569.3526 613.0920 615.1223 617.8164 630.7382 648.5043 695.2213 702.4952 706.3332 739.2977 760.3722 775.8911 791.5495 815.8584 838.0072 852.9484 856.9795 894.7462 898.3337 935.9709 938.4658 953.7360 966.9050 979.9462 981.9784 986.6088 989.7947 990.0612 997.1255 997.2646 1003.7634 1028.2978 1031.5701 1088.0021 1088.5137 1112.2267 1119.1794 1147.3993 1157.7137 1173.3715 1173.5390 1182.5374 1194.6826 1196.4198 1226.8889 1232.0101 1239.7584 1304.9689 1317.4739 1322.8789 1365.8862 1377.4677 1379.4320 1418.9800 1431.8621 1434.9234 1436.8816 1467.4868 1473.1378 1477.1569 1479.3591 1496.9580 1574.1469 1585.1576 1587.3223 1606.5810 1608.0150 1617.2186 2962.0256 3051.1790 3125.7204 3126.2578 3127.1470 3136.0698 3136.6156 3144.3479 3150.4555 3150.8164 3151.6032 3159.5968 3159.8287 3165.5709 3168.8176 3169.3054 3173.0329
redmass: 3.9140 4.1085 4.7182 4.1233 4.8873 4.1924 3.8832 7.1123 7.3435 3.7829 4.0505 4.3939 1.3410 4.8196 4.8851 11.1010 4.9758 4.3490 5.7608 2.8312 2.8514 2.9929 4.3387 3.8710 3.8626 2.8379 4.7604 5.9266 6.3909 5.9648 6.0299 5.5183 4.2660 1.7517 1.7100 3.4082 2.4544 2.9514 2.6044 1.3097 1.6626 1.2523 1.2606 3.6742 4.1500 1.5164 1.6733 1.4096 1.3511 1.3956 1.3834 8.6624 6.1933 6.0776 1.3193 1.3212 2.6568 2.3324 2.1120 1.6122 1.6147 1.2591 1.3600 3.1426 1.3478 1.0523 1.0519 1.2884 1.1166 1.1183 4.0364 2.9262 3.8629 1.2889 1.3662 1.3298 5.2666 7.5239 8.6203 3.7121 2.2194 2.1464 1.2283 1.0503 1.0786 2.1746 2.1990 2.3478 7.0865 6.0243 6.0980 5.9982 6.0462 6.3224 1.0329 1.1041 1.0848 1.0848 1.0995 1.0886 1.0886 1.0877 1.0929 1.0921 1.0887 1.0954 1.0952 1.0955 1.1005 1.1004 1.0967
irintensity: 0.7624 0.0783 0.4565 0.6218 0.7018 2.5056 1.4216 4.1818 4.1740 0.9324 0.4383 1.1357 1.0715 1.1702 1.4262 27.4299 1.2621 4.6822 1.9653 0.1602 0.3767 0.5466 2.9593 0.5426 2.5885 5.7362 36.2763 5.4760 2.9220 12.8411 17.5439 33.1085 5.4869 41.8492 109.5585 28.9126 32.8861 37.2865 22.1035 11.1674 37.4676 1.0974 1.7478 15.6481 4.2480 0.3556 0.1585 1.0634 1.3224 0.5069 0.1735 44.5249 0.2103 1.4874 0.0270 0.0277 10.3393 6.7525 10.2879 2.4966 4.1319 0.1572 6.7414 9.3738 3.5215 0.2595 0.4568 155.2040 8.7336 1.2192 34.2407 0.5183 238.9464 3.4393 3.7972 3.1815 14.1886 2.6932 1.3345 1.9165 20.0920 24.5269 5.3667 13.7277 64.8938 4.1423 14.8075 84.3306 13.9348 1.0519 1.6089 0.6572 0.3900 127.5907 71.9951 44.7612 0.1647 0.1709 27.2902 9.2266 8.0218 7.4543 36.1863 17.9869 0.5723 17.7978 19.9710 11.3788 22.1161 11.5944 4.9614
temp: 298.150 k
press: 1.00000 atm
elementType: 17 8 6 6 6 6 6 6 6 6 6 6 6 6 6 6 6 6 6 6 6 6 1 1 1 1 1 1 1 1 1 1 1 1 1 1 1 1 1
symmnumber: 1
zpe: 805590.2 jmol-1
zpe.correction: 0.306833 hartree
zpe.thermalcorrener: 0.326178 hartree
zpe.thermalcorrenthalpy: 0.327122 hartree
zpe.thermalcorrgfe: 0.257469 hartree
zpe.sumelectzpe: -1306.066058 hartree
zpe.sumelectthermal: -1306.046713 hartree
zpe.sumelectthermalent: -1306.045769 hartree
zpe.sumelectthermalfe: -1306.115421 hartree
dipole: 1.3717 1.1216 -1.8332
dipole: 2.5496
quadrupole: -112.6449 -122.5881 -139.5310
quadrupole: 6.9477 8.0466 -1.2032
quadrupole: 12.2764 2.3333 -14.6097 6.9477 8.0466 -1.2032
hfenergy: -1306.372891 hartree
pointgroup: C01 [X(C20H17Cl1O1)]
dipole: -0.5714201 -0.4258463 -0.705909 debye
polarizability: 280.108823|-0.0003078|239.871779|-2.9900278|0.2892664|175.815028 unknown
InChI: InChI=1S/C20H17ClO/c1-22-19-14-12-18(13-15-19)20(21,16-8-4-2-5-9-16)17-10-6-3-7-11-17/h2-15H,1H3
charge 0 multiplicity 1
39 atoms
Cl 0.784346 -0.00162 2.669367
O  -4.978398 0.825671 -0.526242
C  0.609228 -0.027507 0.649177
C  -0.872259 0.218769 0.384352
C  1.520348 1.104333 0.167769
C  1.094807 -1.4216 0.242852
C  -1.310965 1.196058 -0.549358
C  -1.856283 -0.581397 1.020363
C  2.426513 0.90846 -0.905072
C  2.333285 -1.92124 0.729231
C  1.415258 2.40067 0.740781
C  0.366559 -2.20522 -0.68799
C  -2.678375 1.370679 -0.832335
C  -3.229064 -0.415788 0.754403
C  -3.645187 0.568596 -0.180233
C  3.215266 1.979337 -1.387295
C  2.820318 -3.174641 0.309078
C  2.204007 3.466146 0.263934
C  0.857373 -3.461942 -1.113619
C  3.11043 3.260654 -0.80473
C  2.083172 -3.953622 -0.616025
C  -6.017092 0.022309 0.124874
H  -0.579554 1.822428 -1.068154
H  -1.538184 -1.330149 1.752941
H  2.515575 -0.07806 -1.36985
H  2.896765 -1.327067 1.455524
H  0.726342 2.557248 1.576847
H  -0.581824 -1.833239 -1.087145
H  -3.016763 2.121217 -1.55285
H  -3.956543 -1.043385 1.277651
H  3.909789 1.807218 -2.217131
H  3.771507 -3.54764 0.704973
H  2.116758 4.455348 0.727002
H  0.279275 -4.052116 -1.833466
H  3.726526 4.088315 -1.173667
H  2.460532 -4.929938 -0.9404
H  -6.010618 0.169299 1.222264
H  -5.897694 -1.053917 -0.106682
H  -6.966076 0.388638 -0.292937
