program: Gaussian 09
title: 000084347
version: EM64L-G09RevD.01
frameworkgroup: C1[X(C13H12N2O)]
method: RPBEPBE
basis: SDD
operation: Freq
keyword: #p
keyword: freq=noraman
keyword: PBEPBE/SDD
title: #p freq=noraman PBEPBE/SDD
converged: YES YES NO NO
title: Mulliken charges:
elementType: O N N C C C C C C C C C C C C C H H H H H H H H H H H H
charge: -0.271425 -0.474759 -0.700767 0.312290 0.490644 0.123373 -0.544720 -0.413368 0.508070 -0.208530 -0.416586 -0.347779 -0.450182 -0.214811 -0.198502 -0.256323 0.266020 0.312481 0.214897 0.222468 0.220995 0.309357 0.217660 0.225604 0.224710 0.227693 0.314353 0.307135
chargesum: 0.00000
title: Mulliken charges with hydrogens summed into heavy atoms:
elementType: O N N C C C C C C C C C C C C C
charge: -0.271425 -0.162278 -0.079279 0.312290 0.490644 0.123373 -0.278700 -0.198471 0.508070 0.013938 -0.195590 -0.038422 -0.232522 0.010794 0.026208 -0.028630
polarizability: 2.78064336e+02 5.88047359e+00 1.62116373e+02 -2.95343216e+00 9.49919731e-01 6.76918683e+01
1716.lowfreq: -7.2013 -0.0006 -0.0005 0.0003 2.9202 7.9280 30.4678 42.7812 73.4783
frequency: 30.3604 42.6224 73.4654 95.9336 157.9434 202.5198 218.5173 228.7146 267.5970 339.6360 380.6090 383.5424 395.8061 407.7262 426.4210 464.5724 511.4909 532.1002 547.2143 586.1517 615.6195 652.3834 670.3487 688.3842 697.0178 726.0999 769.8353 781.9863 794.5946 843.2249 846.6313 868.2698 909.1600 918.2249 928.5344 962.1670 972.4823 980.9234 984.2463 1001.5224 1023.9684 1032.7726 1084.0106 1096.6451 1114.7727 1171.7217 1185.1788 1187.3606 1217.0314 1259.1103 1302.9395 1320.2905 1331.5334 1384.7225 1400.1478 1426.3166 1458.8903 1486.2233 1488.4483 1511.9296 1579.3156 1596.0688 1606.0695 1615.5618 1629.5071 1645.2149 3107.5228 3119.4181 3128.8608 3130.9898 3140.6624 3143.4723 3155.0454 3164.5088 3196.6468 3528.0909 3566.4880 3706.8985
redmass: 4.6911 4.8350 5.0679 5.6123 4.8919 4.8412 3.7179 5.3661 4.3247 6.7617 1.1529 3.7379 1.1270 2.9142 3.1818 4.2365 2.9282 6.0924 5.1232 5.7530 6.4453 1.1995 6.5171 2.0760 1.9823 2.9618 1.7171 2.9112 2.8932 1.2904 4.2838 1.5984 1.6481 1.4327 3.6230 1.3529 1.3498 5.4971 6.0446 1.3065 2.0867 1.6257 1.7249 1.8902 1.4905 1.0520 1.0838 1.1124 2.7192 2.0445 1.4703 1.4961 2.2431 5.9956 7.2504 2.4739 3.5103 2.4602 2.8253 2.2294 6.1406 7.6760 3.9257 6.0512 3.4881 1.3783 1.0886 1.0856 1.0912 1.0866 1.0915 1.0933 1.0991 1.0999 1.0950 1.0757 1.0450 1.1041
irintensity: 2.4661 0.8693 1.8010 3.1272 0.2732 6.9145 7.4528 1.8014 2.5228 2.5619 184.9910 3.5000 132.6495 0.2546 1.2843 2.0262 25.7765 0.0866 14.5136 7.2115 1.7267 28.0506 0.8126 16.2235 47.6873 49.3025 110.1566 31.4679 10.4226 0.7064 13.3407 9.7378 24.1748 16.6995 3.9191 1.5802 0.1587 11.0338 0.9467 3.5750 0.6345 18.2264 15.8819 1.2670 7.5015 0.5781 1.4953 1.4110 71.8704 28.6679 13.9032 56.7375 116.7350 102.1998 14.5344 97.7926 53.5792 21.4228 95.0252 459.1504 116.7533 64.0640 34.2722 43.6122 43.7825 266.8347 15.7941 1.6343 31.9004 0.3728 7.5290 31.5704 23.7629 30.0225 8.7567 10.3814 79.6150 22.2326
temp: 298.150 k
press: 1.00000 atm
elementType: 8 7 7 6 6 6 6 6 6 6 6 6 6 6 6 6 1 1 1 1 1 1 1 1 1 1 1 1
symmnumber: 1
zpe: 581079.8 jmol-1
zpe.correction: 0.221322 hartree
zpe.thermalcorrener: 0.234920 hartree
zpe.thermalcorrenthalpy: 0.235864 hartree
zpe.thermalcorrgfe: 0.180113 hartree
zpe.sumelectzpe: -686.217695 hartree
zpe.sumelectthermal: -686.204097 hartree
zpe.sumelectthermalent: -686.203153 hartree
zpe.sumelectthermalfe: -686.258904 hartree
dipole: -2.9953 2.2059 1.0405
dipole: 3.8627
quadrupole: -61.7620 -84.6258 -100.6936
quadrupole: 6.3406 -2.4405 -1.5210
quadrupole: 20.5985 -2.2653 -18.3332 6.3406 -2.4405 -1.5210
hfenergy: -686.4390168 hartree
pointgroup: C01 [X(C13H12N2O1)]
dipole: 1.1769301 -0.8733331 0.4019804 debye
polarizability: 278.0071115|5.9484308|162.1341608|4.3281101|0.6671077|67.7313051 unknown
InChI: InChI=1S/C13H12N2O/c14-11-6-4-5-10(9-11)13(16)15-12-7-2-1-3-8-12/h1-9,15H,14H2
charge 0 multiplicity 1
28 atoms
O  -0.00594 1.792947 -0.287165
N  -0.834888 -0.373285 0.08449
N  5.024504 1.286212 0.526862
C  1.584862 -0.037336 -0.095877
C  -2.241136 -0.159376 0.06998
C  0.194384 0.549387 -0.118265
C  2.641097 0.853318 0.193589
C  1.861896 -1.404027 -0.375564
C  3.988323 0.401288 0.233813
C  3.200392 -1.854613 -0.338895
C  4.256165 -0.97507 -0.031276
C  -2.834291 1.104859 -0.196968
C  -3.072207 -1.283231 0.334514
C  -4.241171 1.220231 -0.198838
C  -4.474654 -1.149537 0.330905
C  -5.070358 0.105366 0.062599
H  2.391772 1.904932 0.376094
H  -0.540842 -1.326407 0.309092
H  1.071587 -2.100603 -0.678187
H  3.426168 -2.902763 -0.565167
H  5.28903 -1.343535 -0.006861
H  -2.191345 1.964887 -0.390449
H  -2.617744 -2.261268 0.54193
H  -4.6916 2.197549 -0.406233
H  -5.101277 -2.02448 0.536559
H  -6.160452 0.210597 0.05888
H  4.833904 2.2685 0.701587
H  5.990021 0.972158 0.547453
