program: Gaussian 09
title: 000084366
version: EM64L-G09RevD.01
frameworkgroup: C1[X(C9H5Cl2NO3S)]
method: RPBEPBE
basis: SDD
operation: Freq
keyword: #p
keyword: freq=noraman
keyword: PBEPBE/SDD
title: #p freq=noraman PBEPBE/SDD
converged: NO YES NO NO
title: Mulliken charges:
elementType: Cl Cl S O O O N C C C C C C C C C H H H H H
charge: 0.041520 0.029598 0.417224 -0.200793 -0.417965 -0.249185 -0.042431 0.083456 -0.071333 0.698365 0.303962 -0.139207 -0.780376 -0.751320 0.119536 -0.493822 0.288350 0.247936 0.264179 0.264300 0.388008
chargesum: 0.00000
title: Mulliken charges with hydrogens summed into heavy atoms:
elementType: Cl Cl S O O O N C C C C C C C C C
charge: 0.041520 0.029598 0.417224 -0.200793 -0.029956 -0.249185 -0.042431 0.083456 -0.071333 0.698365 0.303962 0.149143 -0.780376 0.025094 0.119536 -0.493822
polarizability: 2.14418145e+02 4.60136284e+00 1.44772608e+02 -1.13369081e+01 -1.46203371e-01 8.57809237e+01
1716.lowfreq: -43.8686 -0.0022 -0.0008 0.0012 1.9168 3.4997 9.0918 27.1848 48.3059
frequency: -43.8556 27.1745 48.3025 67.6437 92.8405 112.6682 135.4206 152.2679 166.7587 219.0283 225.4947 274.9649 277.5391 304.6939 335.9989 360.5893 380.0959 421.6627 462.8204 499.5819 546.9654 578.6928 610.1268 626.7975 640.9309 650.4405 693.0597 701.0728 765.0738 770.8271 822.6455 849.0657 939.9983 951.5857 959.6793 1011.8674 1037.6418 1039.1821 1146.8618 1170.2883 1233.0393 1274.1707 1337.0659 1378.9376 1405.8306 1428.4814 1444.1475 1458.8728 1498.5824 1575.6230 1583.0925 1634.4782 3002.4264 3086.2781 3119.8260 3201.1273 3526.5440
redmass: 1.0299 15.2813 8.6831 6.7597 10.1078 19.9446 7.5877 9.7039 9.5256 4.8908 6.0233 9.3509 8.6674 5.9410 23.8023 8.1922 12.9852 8.2524 6.3229 7.0651 5.0718 1.5743 4.8002 5.6769 4.4788 5.7043 6.1830 6.0200 9.9114 8.7698 7.0879 1.5559 3.3517 5.6433 8.9915 3.0094 4.0433 1.7478 1.9119 1.7561 3.9610 3.3327 5.7851 6.0271 1.2862 5.1328 1.0825 1.1799 9.5897 9.5193 9.5099 8.3414 1.0366 1.0965 1.1011 1.0965 1.0642
irintensity: 0.2920 0.0768 0.1699 1.3002 1.9515 0.8058 1.9060 0.4735 1.1119 3.4150 1.0919 0.5092 0.4465 0.9235 2.0122 0.1367 0.4543 5.7797 14.7762 22.8925 17.1081 66.2081 10.3626 5.6190 39.6345 26.5328 20.8272 19.3056 30.7272 18.0005 4.2328 26.2122 37.3359 49.0867 48.9514 151.7971 46.1176 11.2013 28.5747 38.4097 11.0927 14.4581 49.5935 19.1607 21.9212 22.1011 22.4054 8.9852 77.4551 96.0875 104.4210 313.8518 1.8166 2.3451 7.4312 2.4316 48.0885
temp: 298.150 k
press: 1.00000 atm
elementType: 17 17 16 8 8 8 7 6 6 6 6 6 6 6 6 6 1 1 1 1 1
symmnumber: 1
zpe: 324588.0 jmol-1
zpe.correction: 0.123629 hartree
zpe.thermalcorrener: 0.138392 hartree
zpe.thermalcorrenthalpy: 0.139336 hartree
zpe.thermalcorrgfe: 0.079760 hartree
zpe.sumelectzpe: -1943.355543 hartree
zpe.sumelectthermal: -1943.340780 hartree
zpe.sumelectthermalent: -1943.339835 hartree
zpe.sumelectthermalfe: -1943.399412 hartree
dipole: 1.0929 0.8653 1.5619
dipole: 2.0935
quadrupole: -106.6604 -112.6599 -112.6486
quadrupole: -4.8814 -1.0433 -2.7963
quadrupole: 3.9959 -2.0036 -1.9923 -4.8814 -1.0433 -2.7963
hfenergy: -1943.4791715 hartree
pointgroup: C01 [X(C9H5Cl2N1O3S1)]
dipole: 0.3790876 0.7300175 -0.041914 debye
dipolederiv: -0.2371962 -0.0078161 0.2709356 -0.0070895 0.0231066 0.0440484 0.2404995 0.0418907 -0.5696864 -0.5982303 -0.0074632 0.3359112 -0.0021581 0.0224204 0.0234658 0.3864592 0.0292958 -0.3377725 -0.3531481 0.0305267 0.0355284 0.0931596 0.2044634 0.0662741 0.041496 0.0439517 -0.1671407 -0.7383144 -0.0205554 -0.0980397 -0.088593 -0.4627104 0.1341439 -0.0577124 0.1692273 -0.2250018 -0.8947528 0.4552548 -0.0732641 0.3831427 -0.6430642 0.0040728 -0.1051374 -0.0346021 -0.3037241 -0.8928217 -0.1463798 0.1598653 -0.2808638 -0.727668 0.1984413 0.2069871 0.1861762 -0.4176228 0.145445 0.0147434 0.0388139 -0.0375522 -0.2234608 0.0369957 0.0752175 0.0463361 -0.1629683 0.8125806 0.1396664 0.106517 0.1775588 0.2429794 -0.0270212 0.0128702 -0.0957921 0.1096501 -0.6264608 0.1071656 -0.0828329 0.1088053 -0.6094874 0.2573506 -0.0353149 0.2840852 -0.1811811 -0.1383402 0.0273129 -0.0061095 0.0028195 0.0165877 0.0157237 -0.2407784 0.0689225 -0.2226625 0.6995232 -0.2349572 0.1228527 -0.0359283 0.4833701 -0.1766777 0.0258135 -0.1825492 0.1947389 -0.3573296 0.0258423 -0.0513281 0.0771044 -0.0813874 0.019504 -0.0280859 0.01184 -0.157684 0.659548 -0.0546676 -0.2221904 -0.142971 -0.1519109 -0.109486 -0.0795634 -0.0702353 0.7587233 -0.2891764 -0.0328906 0.0097226 -0.142922 0.0191324 -0.0242232 0.1307811 -0.0236793 0.042545 1.4994756 -0.2165217 -0.1580224 -0.0493111 1.496646 -0.455387 -0.1749819 -0.5042762 0.4646831 0.7751469 -0.0203488 -0.3794717 -0.0631709 -0.192384 -0.1194004 -0.3717141 -0.1262986 0.6934239 0.1208126 0.0206974 -0.0410297 0.0022516 0.1801622 0.0365224 -0.0137232 0.0182826 0.0422681 0.0616944 0.0266983 -0.0277544 0.0838235 0.0332813 0.0889265 -0.0860927 0.0855783 0.0573565 0.040888 0.00692 0.0039762 0.0075904 0.1257382 -0.0108318 0.0332753 -0.0202513 -0.0297464 0.0691164 0.0095081 -0.0013364 -0.0196279 -0.0169606 -0.0552501 -0.0198625 -0.0392285 0.1110374 0.2415398 -0.1227356 0.0572563 -0.066068 0.2611461 0.0528082 0.0595672 0.1113261 0.3007641 unknown
polarizability: 212.5881438|-2.3895587|98.6944297|-15.8498951|-25.2102215|133.6891023 unknown
InChI: InChI=1S/C9H5Cl2NO3S/c1-3-6(9(13)14)7(12-15-3)4-2-5(10)16-8(4)11/h2,13H,1H3
charge 0 multiplicity 1
21 atoms
Cl -0.868376 0.070077 -2.675707
Cl -4.768306 -0.22528 1.822994
S  -3.427208 0.117733 -0.95859
O  2.237777 -1.600875 1.093289
O  0.458947 2.275617 -0.674078
O  2.753612 2.121121 -1.006062
N  0.763657 -1.659916 1.031134
C  0.408288 -0.524432 0.37579
C  1.565539 0.273471 0.011306
C  -1.032038 -0.304001 0.148822
C  2.676535 -0.445474 0.464861
C  -2.000421 -0.406789 1.226598
C  -1.637075 -0.044806 -1.07159
C  4.147025 -0.209621 0.417653
C  1.679972 1.600379 -0.606302
C  -3.29774 -0.20484 0.815281
H  -1.709608 -0.622367 2.256004
H  4.671791 -0.931691 1.063531
H  4.519617 -0.307731 -0.617174
H  4.382834 0.819654 0.737867
H  0.604276 3.15967 -1.107329
